{"text_format":"1","workbook":"xlsx","n_sheets":8,"sheets":["language","Handleiding validatie","Emission data","Gaseous fuels","Liquid fuels","Solid fuels","Validation test","Data"],"not_rendered":{"charts":0,"images":1,"macros":1,"external_links":0,"defined_names":51,"comments":2,"pivot_tables":0},"unopened":[],"bounds":{"document_bytes":16777216,"sheet_cells":100000,"rows_first":2000,"rows_last":500,"rows_between":2000,"halvings":0,"cell_chars":16384,"cell_head_chars":4096},"cells_cut":0,"cells_raw":0,"read":"whole","date_system":"1900"}

{"sheet":"language","index":0,"n_rows":252,"n_cols":10,"rows_kept":252,"cut":false,"hidden":true,"merged":[]}
["Current language choice",{"$f":"A11","v":"ENGELS"},{"$f":"A12","v":"NEDERLANDS"},{"$f":"A13","v":"POOLS"},{"$f":"IF(A14=\"\",\"--\",A14)","v":"TSJECHISCH"},{"$f":"IF(A15=\"\",\"--\",A15)","v":"BULGAARS"},{"$f":"IF(A16=\"\",\"--\",A16)","v":"KROATISCH"},{"$f":"IF(A17=\"\",\"--\",A17)","v":"DUITS"},{"$f":"IF(A18=\"\",\"--\",A18)","v":"FRANS"},{"$f":"IF(A19=\"\",\"--\",A19)","v":"--"}]
[{"$f":"IF(INDEX(B2:J2,Data!$K$4)=\"\",\"\",INDEX(B2:J2,Data!$K$4))","v":"Validatietest voor emissies naar lucht"},"Validation test for emission data","Validatietest voor emissies naar lucht","Test oceny danych emisyjnych","Ověřovací  test pro emisní  údaje","Тест за валидиране на данните за изпуснати емисии","Test provjere emisija u zrak"]
[{"$f":"IF(INDEX(B3:J3,Data!$K$4)=\"\",\"\",INDEX(B3:J3,Data!$K$4))","v":"Ondanks de zorgvuldigheid waarmee dit werkblad is opgesteld, zijn fouten niet uit te sluiten."},"Although this spreadsheet has been carefully developed, mistakes in the calculated values can not be excluded.","Ondanks de zorgvuldigheid waarmee dit werkblad is opgesteld, zijn fouten niet uit te sluiten.","Pomimo iż niniejszy arkusz został przygotowany ze szczególną starannością, nie można wykluczyć błędów kalkulacyjnych.","přestože byl tento tabulkový procesor pečlivě připravován, nelze vyloučit chyby ve vypočítaných hodnotách.","Въпреки че тази програма е била разработен много внимателно, може да има допуснати някои грешки в изчислените стойности.","Ova verzija je pažljivo razvijena, nepredviđene pogreške su moguće."]
[{"$f":"IF(INDEX(B4:J4,Data!$K$4)=\"\",\"\",INDEX(B4:J4,Data!$K$4))","v":"Versie"},"Version","Versie","Wersja","Verze ","Вариант ","Verzija "]
[{"$f":"IF(INDEX(B5:J5,Data!$K$4)=\"\",\"\",INDEX(B5:J5,Data!$K$4))","v":"Deze versie is te gebruiken tot "},"This version can be used until","Deze versie is te gebruiken tot "]
[{"$f":"IF(INDEX(B6:J6,Data!$K$4)=\"\",\"\",INDEX(B6:J6,Data!$K$4))","v":"Deze versie is verlopen; download een nieuwe versie van www.InfoMil.nl"},"This version is outdated, download the last version from www.InfoMil.nl","Deze versie is verlopen; download een nieuwe versie van www.InfoMil.nl"]
[{"$f":"IF(INDEX(B7:J7,Data!$K$4)=\"\",\"\",INDEX(B7:J7,Data!$K$4))","v":"Afwijkend van verwachtingswaarde"},"Different from expected value","Afwijkend van verwachtingswaarde","odbiegające od oczekiwanej wartości ","Odlišné od očekávané hodnoty","Различно от очакваната стойност","Različito od očekivane vrijednosti "]
[{"$f":"IF(INDEX(B8:J8,Data!$K$4)=\"\",\"\",INDEX(B8:J8,Data!$K$4))","v":"Ok"},"Okay","Ok","Ok","Ok","Ok","U redu"]
[{"$f":"IF(INDEX(B9:J9,Data!$K$4)=\"\",\"\",INDEX(B9:J9,Data!$K$4))","v":"Nm3: m3 onder standaard condities"},"Nm3: m3 at standard conditions","Nm3: m3 onder standaard condities","Nm3: m3 w warunkach normalnych ","Nm3: m3 za normálních podmínek","Nm3: m3 в нормални условия","Nm3: m3 u standardnim uvjetima"]
[{"$f":"IF(INDEX(B10:J10,Data!$K$4)=\"\",\"\",INDEX(B10:J10,Data!$K$4))","v":"Taal"},"Language","Taal","Język","Jazyk","Език","Jezik"]
{"$rows_left_out":243}
{"sheet":"Handleiding validatie","index":1,"n_rows":0,"n_cols":0,"rows_kept":0,"cut":false,"hidden":true,"merged":[]}

{"sheet":"Emission data","index":2,"n_rows":37,"n_cols":14,"rows_kept":37,"cut":false,"hidden":false,"merged":[[30,12,30,13],[33,12,33,13],[28,12,28,13],[10,8,10,9],[10,12,10,13],[10,10,10,11],[28,9,28,11],[29,12,29,13],[29,6,29,8],[1,4,1,7],[8,12,8,13],[1,8,1,13],[8,4,8,5],[8,6,8,7],[8,8,8,9],[2,8,2,9],[2,12,7,13],[8,10,8,11],[29,4,29,5],[10,4,10,5],[10,6,10,7],[28,4,28,5],[28,6,28,8]]}
[{"$f":"IF(OR(NOW()>Data!B2,I2=\"\"),0,1)","v":1}]
[null,{"$f":"language!A20","v":"Installatie/eenheid"},null,null,null,null,null,null,{"$f":"language!A2","v":"Validatietest voor emissies naar lucht"}]
[null,{"$f":"language!A21","v":"Type"},null,null,1,null,null,null,{"$f":"language!A10","v":"Taal"},null,null,null,{"$f":"IF(NOW()<=Data!B2,CONCATENATE(language!A4,\" \",Data!B1,\" : \",IF(language!A5=\"\",\"\",CONCATENATE(language!A5,\" \",DAY(Data!B2),\"-\",MONTH(Data!B2),\"-\",YEAR(Data!B2),\".\",CHAR(10))),language!A3),IF(language!A6=\"\",\"\",language!A6))","v":"Versie 2024 : Deze versie is te gebruiken tot  1-4-2026.\nOndanks de zorgvuldigheid waarmee dit werkblad is opgesteld, zijn fouten niet uit te sluiten."}]
[null,{"$f":"language!A26","v":"Bedrijfsvoering"},null,null,1,{"$f":"IF(A1=1,IF(ISNUMBER(H4),H4,INDEX(Data!C5:C9,'Emission data'!E4)),\"\")","v":8760},null,null,{"$f":"language!A98","v":"Menu"},{"$f":"language!A61","v":"Validatietest"}]
[null,{"$f":"language!A22","v":"Thermisch vermogen"},null,null,{"$f":"IF(A1=1,IF(H5<>\"\",H5,IF(G5=899,0,(1+(G5-TRUNC(G5/900)*900)/100)*10^(TRUNC(G5/900)-2))),\"\")","v":50},{"$f":"language!A65","v":"MW"},3100,null,null,{"$f":"language!A62","v":"Wijzig gegevens gasvormige brandstoffen"}]
[null,{"$f":"language!A23","v":"Elektrisch rendement"},null,null,{"$f":"IF(A1=1,IF(H6<>\"\",H6,IF(OR(E3=1,E3=3,E3=8),0,G6)),\"\")","v":0},{"$f":"IF(A1=0,\"\",\"%\")","v":"%"},40,null,null,{"$f":"language!A63","v":"Wijzig gegevens vloeibare brandstoffen"}]
[null,{"$f":"language!A24","v":"Elektrische belasting"},null,null,{"$f":"IF(A1=1,E6/100*E5,\"\")","v":0},{"$f":"language!A65","v":"MW"},null,null,null,{"$f":"language!A64","v":"Wijzig gegevens vaste brandstoffen"}]
[null,{"$f":"IF(E8=\"\",\"\",language!A25)","v":"Max. stoomproductie"},null,null,{"$f":"IF(A1=1,IF(OR(E3=2,E3=4,E3=6),\"\",(E5-E7)*3600/2.3/1000),\"\")","v":78.260869565217391},{"$f":"IF(E8=\"\",\"\",language!A66)","v":"ton/uur"},null,null,null,{"$f":"language!A226","v":"Wis invoer"}]
[null,{"$f":"language!A27","v":"Brandstof"},null,null,1,null,{"$f":"IF(E9=\"\",\"\",IF(G10=1,\"\",E9+1))","v":""},null,{"$f":"IF(G9=\"\",\"\",IF(I10=1,\"\",G9+1))","v":""},null,{"$f":"IF(I9=\"\",\"\",IF(K10=1,\"\",I9+1))","v":""},null,{"$f":"language!A68","v":"Totaal"}]
[null,{"$f":"B3","v":"Type"},null,null,{"$f":"IF(A1=1,F10,1)","v":1},1,{"$f":"IF(A1=1,H10,1)","v":1},1,{"$f":"IF(A1=1,J10,1)","v":1},1,{"$f":"IF(A1=1,L10,1)","v":1},1]
{"$rows_left_out":28}
{"sheet":"Gaseous fuels","index":3,"n_rows":90,"n_cols":18,"rows_kept":90,"cut":false,"hidden":false,"merged":[]}
[{"$f":"IF(NOW()>Data!B2,0,1)","v":1}]
[null,null,{"$f":"language!A142","v":"Omschrijving"},{"$f":"language!A28","v":"AARDGAS"},"HC Gas","GF1","GF 2","GF 3"]
[null,{"$f":"language!A34","v":"Onderste verbrandingswaarde"},{"$f":"language!A71","v":"kJ/Nm3"},null,null,28000,35000,40000]
[null,{"$f":"language!A52","v":"Gehalte fossiele brandstof"},"%",100,100,100,100,100]
[null,{"$f":"B3","v":"Onderste verbrandingswaarde"},{"$f":"language!A70","v":"MJ/Nm3"},{"$f":"IF($A1=1,IF(D67=\"\",IF(D3=\"\",\"\",D3/1000),D67),\"\")","v":31.668546173147696},{"$f":"IF($A1=1,IF(E67=\"\",IF(E3=\"\",\"\",E3/1000),E67),\"\")","v":36.271670288908943},{"$f":"IF($A1=1,IF(F67=\"\",IF(F3=\"\",\"\",F3/1000),F67),\"\")","v":28},{"$f":"IF($A1=1,IF(G67=\"\",IF(G3=\"\",\"\",G3/1000),G67),\"\")","v":35},{"$f":"IF($A1=1,IF(H67=\"\",IF(H3=\"\",\"\",H3/1000),H67),\"\")","v":40}]
[null,{"$f":"language!A35","v":"Bovenste verbrandingswaarde"},{"$f":"C5","v":"MJ/Nm3"},{"$f":"IF(D64=\"\",IF(D5=\"\",\"\",D5+(D18-D17)*44.0136/21.629),D64)","v":35.094354942641466},{"$f":"IF(E64=\"\",IF(E5=\"\",\"\",E5+(E18-E17)*44.0136/21.629),E64)","v":40.165411579420812},{"$f":"IF(F64=\"\",IF(F5=\"\",\"\",F5+(F18-F17)*44.0136/21.629),F64)","v":31.123421084654861},{"$f":"IF(G64=\"\",IF(G5=\"\",\"\",G5+(G18-G17)*44.0136/21.629),G64)","v":38.943906706736321},{"$f":"IF(H64=\"\",IF(H5=\"\",\"\",H5+(H18-H17)*44.0136/21.629),H64)","v":44.529967865365947}]
[null,{"$f":"language!A36","v":"Wobbe-index"},{"$f":"C6","v":"MJ/Nm3"},{"$f":"IF(D65=\"\",IF(OR(D3=\"\",$A1=0),\"\",D6/SQRT(0.82/1.293)),D65)","v":43.706191188449452},{"$f":"IF(E65=\"\",IF(OR(E3=\"\",$A1=0),\"\",E6/SQRT(0.82/1.293)),E65)","v":50.933430463527955},{"$f":"IF(F65=\"\",IF(OR(F3=\"\",$A1=0),\"\",F6/SQRT(0.82/1.293)),F65)","v":39.082259568393766},{"$f":"IF(G65=\"\",IF(OR(G3=\"\",$A1=0),\"\",G6/SQRT(0.82/1.293)),G65)","v":48.902589030304156},{"$f":"IF(H65=\"\",IF(OR(H3=\"\",$A1=0),\"\",H6/SQRT(0.82/1.293)),H65)","v":55.917110074525873}]
[null,{"$f":"language!A33","v":"Berekeningsmethode"},null,{"$f":"IF(D66=\"\",IF(D5=\"\",\"\",language!$A$198),language!$A$199)","v":"samenstelling"},{"$f":"IF(E66=\"\",IF(E5=\"\",\"\",language!$A$198),language!$A$199)","v":"samenstelling"},{"$f":"IF(F66=\"\",IF(F5=\"\",\"\",language!$A$198),language!$A$199)","v":"DIN1942"},{"$f":"IF(G66=\"\",IF(G5=\"\",\"\",language!$A$198),language!$A$199)","v":"DIN1942"},{"$f":"IF(H66=\"\",IF(H5=\"\",\"\",language!$A$198),language!$A$199)","v":"DIN1942"}]
[null,{"$f":"language!A154","v":"Koolstofdioxide"},{"$f":"language!A80","v":"Nm3/Nm3"},{"$f":"IF(D8=\"\",\"\",IF(D8=language!$A$198,D84,D76))","v":0.89690470911101583},{"$f":"IF(E8=\"\",\"\",IF(E8=language!$A$198,E84,E76))","v":1.0403934365117815},{"$f":"IF(F8=\"\",\"\",IF(F8=language!$A$198,F84,F76))","v":0.86295999999999995},{"$f":"IF(G8=\"\",\"\",IF(G8=language!$A$198,G84,G76))","v":1.02095},{"$f":"IF(H8=\"\",\"\",IF(H8=language!$A$198,H84,H76))","v":1.1338000000000001}]
[null,null,{"$f":"language!A76","v":"kg/GJ"},{"$f":"IF(D9=\"\",\"\",D9/'Gaseous fuels'!$L$29*'Gaseous fuels'!$K$29*1000/D5)","v":56.029105319939347},{"$f":"IF(E9=\"\",\"\",E9/'Gaseous fuels'!$L$29*'Gaseous fuels'!$K$29*1000/E5)","v":56.744733211764981},{"$f":"IF(F9=\"\",\"\",F9/'Gaseous fuels'!$L$29*'Gaseous fuels'!$K$29*1000/F5)","v":60.97167755246987},{"$f":"IF(G9=\"\",\"\",G9/'Gaseous fuels'!$L$29*'Gaseous fuels'!$K$29*1000/G5)","v":57.707457307123505},{"$f":"IF(H9=\"\",\"\",H9/'Gaseous fuels'!$L$29*'Gaseous fuels'!$K$29*1000/H5)","v":56.075347184450322}]
{"$rows_left_out":81}
{"sheet":"Liquid fuels","index":4,"n_rows":51,"n_cols":8,"rows_kept":51,"cut":false,"hidden":false,"merged":[]}
[{"$f":"IF(NOW()>Data!B2,0,1)","v":1}]
[null,null,{"$f":"'Gaseous fuels'!C2","v":"Omschrijving"},{"$f":"language!A29","v":"DIESEL"},{"$f":"language!A30","v":"HFO"},{"$f":"language!A31","v":"LFO"},"LF1","LF 2"]
[null,{"$f":"'Gaseous fuels'!B3","v":"Onderste verbrandingswaarde"},{"$f":"language!A73","v":"kJ/kg"},42480,40230,42650,41000,45000]
[null,{"$f":"'Gaseous fuels'!B4","v":"Gehalte fossiele brandstof"},"%",100,100,100,100,100]
[null,{"$f":"'Gaseous fuels'!B5","v":"Onderste verbrandingswaarde"},{"$f":"language!A72","v":"MJ/kg"},{"$f":"IF($A1=1,IF(D3=\"\",\"\",D3/1000),\"\")","v":42.48},{"$f":"IF($A1=1,IF(E3=\"\",\"\",E3/1000),\"\")","v":40.229999999999997},{"$f":"IF($A1=1,IF(F3=\"\",\"\",F3/1000),\"\")","v":42.65},{"$f":"IF($A1=1,IF(G3=\"\",\"\",G3/1000),\"\")","v":41},{"$f":"IF($A1=1,IF(H3=\"\",\"\",H3/1000),\"\")","v":45}]
[null,{"$f":"'Gaseous fuels'!B6","v":"Bovenste verbrandingswaarde"},{"$f":"C5","v":"MJ/kg"},{"$f":"IF(D5=\"\",\"\",D5+(D18-D17)*44.0136/21.629)","v":45.340294473658098},{"$f":"IF(E5=\"\",\"\",E5+(E18-E17)*44.0136/21.629)","v":42.513868717134635},{"$f":"IF(F5=\"\",\"\",F5+(F18-F17)*44.0136/21.629)","v":45.569247107848},{"$f":"IF(G5=\"\",\"\",G5+(G18-G17)*44.0136/21.629)","v":43.758557314716349},{"$f":"IF(H5=\"\",\"\",H5+(H18-H17)*44.0136/21.629)","v":48.505785291969111}]
[null,{"$f":"'Gaseous fuels'!B7","v":"Wobbe-index"},{"$f":"C6","v":"MJ/kg"}]
[null,{"$f":"'Gaseous fuels'!B8","v":"Berekeningsmethode"},null,{"$f":"IF($A1=1,IF(OR(D29=0,D29=\"\"),IF(D3=\"\",\"\",language!$A$198),language!$A$199),\"\")","v":"samenstelling"},{"$f":"IF($A1=1,IF(OR(E29=0,E29=\"\"),IF(E3=\"\",\"\",language!$A$198),language!$A$199),\"\")","v":"samenstelling"},{"$f":"IF($A1=1,IF(OR(F29=0,F29=\"\"),IF(F3=\"\",\"\",language!$A$198),language!$A$199),\"\")","v":"samenstelling"},{"$f":"IF($A1=1,IF(OR(G29=0,G29=\"\"),IF(G3=\"\",\"\",language!$A$198),language!$A$199),\"\")","v":"DIN1942"},{"$f":"IF($A1=1,IF(OR(H29=0,H29=\"\"),IF(H3=\"\",\"\",language!$A$198),language!$A$199),\"\")","v":"DIN1942"}]
[null,{"$f":"'Gaseous fuels'!B9","v":"Koolstofdioxide"},{"$f":"language!A81","v":"Nm3/kg"},{"$f":"IF(D$8=\"\",\"\",IF(D$8=language!$A$198,D45,D37))","v":1.5965480143202064},{"$f":"IF(E$8=\"\",\"\",IF(E$8=language!$A$198,E45,E37))","v":1.5850647223378569},{"$f":"IF(F$8=\"\",\"\",IF(F$8=language!$A$198,F45,F37))","v":1.5987705869619515},{"$f":"IF(G$8=\"\",\"\",IF(G$8=language!$A$198,G45,G37))","v":1.574022},{"$f":"IF(H$8=\"\",\"\",IF(H$8=language!$A$198,H45,H37))","v":1.6113900000000001}]
[null,null,{"$f":"language!A76","v":"kg/GJ"},{"$f":"IF(OR(D9=\"\",D5=\"\"),\"\",D9/'Gaseous fuels'!$L$29*'Gaseous fuels'!$K$29*1000/D5)","v":74.352056597209},{"$f":"IF(OR(E9=\"\",E5=\"\"),\"\",E9/'Gaseous fuels'!$L$29*'Gaseous fuels'!$K$29*1000/E5)","v":77.94575669957689},{"$f":"IF(OR(F9=\"\",F5=\"\"),\"\",F9/'Gaseous fuels'!$L$29*'Gaseous fuels'!$K$29*1000/F5)","v":74.15878812924808},{"$f":"IF(OR(G9=\"\",G5=\"\"),\"\",G9/'Gaseous fuels'!$L$29*'Gaseous fuels'!$K$29*1000/G5)","v":75.949068426025022},{"$f":"IF(OR(H9=\"\",H5=\"\"),\"\",H9/'Gaseous fuels'!$L$29*'Gaseous fuels'!$K$29*1000/H5)","v":70.840833146783794}]
{"$rows_left_out":42}
{"sheet":"Solid fuels","index":5,"n_rows":53,"n_cols":8,"rows_kept":53,"cut":false,"hidden":false,"merged":[]}
[{"$f":"IF(NOW()>Data!B2,0,1)","v":1}]
[null,null,{"$f":"'Liquid fuels'!C2","v":"Omschrijving"},{"$f":"language!A32","v":"KOLEN"},"SF 1","SF 2","SF 3","SF 4"]
[null,{"$f":"'Liquid fuels'!B3","v":"Onderste verbrandingswaarde"},{"$f":"'Liquid fuels'!C3","v":"kJ/kg"},25870,10000,15000,20000,25000]
[null,{"$f":"'Liquid fuels'!B4","v":"Gehalte fossiele brandstof"},{"$f":"'Liquid fuels'!C4","v":"%"},100,100,50,100,100]
[null,{"$f":"'Liquid fuels'!B5","v":"Onderste verbrandingswaarde"},{"$f":"'Liquid fuels'!C5","v":"MJ/kg"},{"$f":"IF($A1=1,IF(D3=\"\",\"\",D3/1000),\"\")","v":25.87},{"$f":"IF($A1=1,IF(E3=\"\",\"\",E3/1000),\"\")","v":10},{"$f":"IF($A1=1,IF(F3=\"\",\"\",F3/1000),\"\")","v":15},{"$f":"IF($A1=1,IF(G3=\"\",\"\",G3/1000),\"\")","v":20},{"$f":"IF($A1=1,IF(H3=\"\",\"\",H3/1000),\"\")","v":25}]
[null,{"$f":"'Liquid fuels'!B6","v":"Bovenste verbrandingswaarde"},{"$f":"'Liquid fuels'!C6","v":"MJ/kg"},{"$f":"IF(D5=\"\",\"\",D5+(D18-D17)*44.0136/21.629)","v":27.012400320696798},{"$f":"IF(E5=\"\",\"\",E5+(E18-E17)*44.0136/21.629)","v":11.891675184243375},{"$f":"IF(F5=\"\",\"\",F5+(F18-F17)*44.0136/21.629)","v":16.722775614221646},{"$f":"IF(G5=\"\",\"\",G5+(G18-G17)*44.0136/21.629)","v":21.553876044199917},{"$f":"IF(H5=\"\",\"\",H5+(H18-H17)*44.0136/21.629)","v":26.384976474178188}]
[null,{"$f":"'Liquid fuels'!B7","v":"Wobbe-index"},{"$f":"'Liquid fuels'!C7","v":"MJ/kg"}]
[null,{"$f":"'Liquid fuels'!B8","v":"Berekeningsmethode"},null,{"$f":"IF($A1=1,IF(OR(D30=0,D30=\"\"),IF(D3=\"\",\"\",language!$A$198),language!$A$199),\"\")","v":"samenstelling"},{"$f":"IF($A1=1,IF(OR(E30=0,E30=\"\"),IF(E3=\"\",\"\",language!$A$198),language!$A$199),\"\")","v":"DIN1942"},{"$f":"IF($A1=1,IF(OR(F30=0,F30=\"\"),IF(F3=\"\",\"\",language!$A$198),language!$A$199),\"\")","v":"DIN1942"},{"$f":"IF($A1=1,IF(OR(G30=0,G30=\"\"),IF(G3=\"\",\"\",language!$A$198),language!$A$199),\"\")","v":"DIN1942"},{"$f":"IF($A1=1,IF(OR(H30=0,H30=\"\"),IF(H3=\"\",\"\",language!$A$198),language!$A$199),\"\")","v":"DIN1942"}]
[null,{"$f":"'Liquid fuels'!B9","v":"Koolstofdioxide"},{"$f":"'Liquid fuels'!C9","v":"Nm3/kg"},{"$f":"IF(D$8=\"\",\"\",IF(D$8=language!$A$198,D47,D39))","v":1.2547978363500125},{"$f":"IF(E$8=\"\",\"\",IF(E$8=language!$A$198,E47,E39))","v":0.54159999999999997},{"$f":"IF(F$8=\"\",\"\",IF(F$8=language!$A$198,F47,F39))","v":0.76159999999999994},{"$f":"IF(G$8=\"\",\"\",IF(G$8=language!$A$198,G47,G39))","v":0.98159999999999992},{"$f":"IF(H$8=\"\",\"\",IF(H$8=language!$A$198,H47,H39))","v":1.2015999999999998}]
[null,null,{"$f":"'Liquid fuels'!C10","v":"kg/GJ"},{"$f":"IF(OR(D9=\"\",D5=\"\"),\"\",D9/'Gaseous fuels'!$L$29*'Gaseous fuels'!$K$29*1000/D5)","v":95.956156100561984},{"$f":"IF(OR(E9=\"\",E5=\"\"),\"\",E9/'Gaseous fuels'!$L$29*'Gaseous fuels'!$K$29*1000/E5)","v":107.1455566593695},{"$f":"IF(OR(F9=\"\",F5=\"\"),\"\",F9/'Gaseous fuels'!$L$29*'Gaseous fuels'!$K$29*1000/F5)","v":100.4456621759919},{"$f":"IF(OR(G9=\"\",G5=\"\"),\"\",G9/'Gaseous fuels'!$L$29*'Gaseous fuels'!$K$29*1000/G5)","v":97.095714934303089},{"$f":"IF(OR(H9=\"\",H5=\"\"),\"\",H9/'Gaseous fuels'!$L$29*'Gaseous fuels'!$K$29*1000/H5)","v":95.085746589289798}]
{"$rows_left_out":44}
{"sheet":"Validation test","index":6,"n_rows":18,"n_cols":5,"rows_kept":18,"cut":false,"hidden":false,"merged":[[1,2,1,4]]}
[{"$f":"IF(NOW()>Data!B2,0,1)","v":1}]
[null,{"$f":"'Emission data'!B2","v":"Installatie/eenheid"},{"$f":"IF($A1=1,CONCATENATE(INDEX(Data!F5:F12,'Emission data'!E3),IF('Emission data'!E2=\"\",\"\",CONCATENATE(\" : \",'Emission data'!E2))),\"\")","v":"KETEL"}]
[null,{"$f":"'Emission data'!B6","v":"Elektrisch rendement"},{"$f":"IF($A1=1,IF('Emission data'!E6=0,\"--\",'Emission data'!E6/100),\"\")","v":"--"},null,{"$f":"IF(A1=1,IF('Emission data'!E6=0,\"\",IF(OR(INDEX(Data!G5:G12,'Emission data'!E3)>100*'Validation test'!C3,INDEX(Data!H5:H12,'Emission data'!E3)<100*'Validation test'!C3),language!A7, \"\")),\"\")","v":""}]
[null,{"$f":"Data!A43","v":"Gerapporteerde stoomproductie"},null,null,{"$f":"IF(Data!C47>0,language!A7,IF(Data!C47=0,language!A8,\"\"))","v":""}]
[null,{"$f":"'Emission data'!B4","v":"Bedrijfsvoering"},{"$f":"'Emission data'!F4","v":8760},{"$f":"IF(C5=\"\",\"\",language!A67)","v":"uur/jaar"},{"$f":"IF(AND($A1=1,C5<>\"\"),IF(OR(C5>8760,C5<0),language!A7,\"\"),\"\")","v":""}]
[null,{"$f":"Data!A49","v":"Gerapporteerde bedrijfstijd"},null,null,{"$f":"IF(Data!C53>0,language!A7,IF(Data!C53=0,language!A8,\"\"))","v":""}]
[null,{"$f":"language!A136","v":"Gemiddelde belasting"},{"$f":"IF($A1=1,IF('Emission data'!M23=\"\",\"\",'Emission data'!M23/100),\"\")","v":0},null,{"$f":"IF($A1=1,IF(C7=\"\",\"\",IF(OR(C7>Data!C115,C7<Data!B115),language!A7,\"\")),\"\")","v":"Afwijkend van verwachtingswaarde"}]
[null,{"$f":"CONCATENATE(language!A135,\" \",language!A39,\"-\",LOWER(language!A56),language!A141)","v":"Gerapporteerde CO2-emissie in % van de theoretische waarde"},{"$f":"IF(OR('Emission data'!M21=0,'Emission data'!M21=\"\"),\"\",'Emission data'!J35/'Emission data'!M21)","v":""},null,{"$f":"IF($A$1=1,IF(C8=\"\",\"\",IF(OR(C8>Data!C117,C8<Data!B117),language!$A$7,language!$A$8)),\"\")","v":""}]
[null,{"$f":"CONCATENATE(language!$A$138,\" \",language!A40,\"-\",language!$A$139)","v":"Emissie-eis NOx-concentratie"},null,null,{"$f":"IF(Data!C62=0,language!A8,IF(Data!C62=1,language!A7,IF(Data!C62=2,language!A7,\"\")))","v":""}]
[null,{"$f":"CONCATENATE(language!$A$135,\" \",language!A40,\"-\",language!$A$139)","v":"Gerapporteerde NOx-concentratie"},null,null,{"$f":"IF(Data!C71=0,language!A8,IF(Data!C71=1,language!A7,IF(Data!C71=2,language!A7,\"\")))","v":""}]
{"$rows_left_out":9}
{"sheet":"Data","index":7,"n_rows":125,"n_cols":17,"rows_kept":125,"cut":false,"hidden":true,"merged":[]}
["Version","2024"]
[{"$f":"language!A97","v":"Geldigheid"},"2026-04-01"]
["Nu nog geldig",{"$f":"IF(NOW()>Data!B2,0,1)","v":1}]
["menu optie",0,null,null,null,null,{"$f":"language!A111","v":"Min rendement"},{"$f":"language!A112","v":"Max rendement"},null,null,2,null,"bij O2"]
[{"$f":"language!A26","v":"Bedrijfsvoering"},{"$f":"IF(OR(language!$A$99=\"\",language!$A$100=\"\"),\"\",CONCATENATE(IF('Emission data'!$H$4<>\"\",'Emission data'!H4,Data!C5),\" \",UPPER(D5),IF('Emission data'!$H$4<>\"\",\"\",CONCATENATE(\" (7 \",LOWER(language!$A$99),\"; 24 \",LOWER(language!$A$100),\")\"))))","v":"8760 UUR/JAAR (7 dagen/week; 24 uur/dag)"},{"$f":"TRUNC(8760)","v":8760},{"$f":"language!A67","v":"uur/jaar"},{"$f":"language!A102","v":"Installatie type"},{"$f":"language!A103","v":"KETEL"},0,0,null,{"$f":"language!A10","v":"Taal"},{"$f":"IF(language!A11=\"\",\"\",language!A11)","v":"ENGELS"},null,{"$f":"IF('Emission data'!M22=0,\"\",CONCATENATE(\" \",language!A94,\" \",'Emission data'!G34,\"% \",language!A37))","v":""}]
[null,{"$f":"IF(OR(language!$A$99=\"\",language!$A$100=\"\"),\"\",CONCATENATE(IF('Emission data'!$H$4<>\"\",'Emission data'!$H$4,Data!C6),\" \",UPPER(D6),IF('Emission data'!$H$4<>\"\",\"\",CONCATENATE(\" (7 \",LOWER(language!$A$99),\"; 16 \",LOWER(language!$A$100),\")\"))))","v":"5840 UUR/JAAR (7 dagen/week; 16 uur/dag)"},{"$f":"TRUNC(C5*2/3)","v":5840},{"$f":"D5","v":"uur/jaar"},null,{"$f":"language!A104","v":"KETEL MET STOOMTURBINE"},38,45,null,null,{"$f":"IF(language!A12=\"\",\"\",language!A12)","v":"NEDERLANDS"}]
[null,{"$f":"IF(OR(language!$A$99=\"\",language!$A$100=\"\"),\"\",CONCATENATE(IF('Emission data'!$H$4<>\"\",'Emission data'!$H$4,Data!C7),\" \",UPPER(D7),IF('Emission data'!$H$4<>\"\",\"\",CONCATENATE(\" (5 \",LOWER(language!$A$99),\"; 16 \",LOWER(language!$A$100),\")\"))))","v":"4171 UUR/JAAR (5 dagen/week; 16 uur/dag)"},{"$f":"TRUNC(C6*5/7)","v":4171},{"$f":"D6","v":"uur/jaar"},null,{"$f":"language!A105","v":"PROCESFORNUIS"},0,0,null,null,{"$f":"IF(language!A13=\"\",\"\",language!A13)","v":"POOLS"}]
[null,{"$f":"IF(OR(language!$A$99=\"\",language!$A$100=\"\"),\"\",CONCATENATE(IF('Emission data'!$H$4<>\"\",'Emission data'!$H$4,Data!C8),\" \",UPPER(D8),IF('Emission data'!$H$4<>\"\",\"\",CONCATENATE(\" (5 \",LOWER(language!$A$99),\"; 8 \",LOWER(language!$A$100),\")\"))))","v":"2085 UUR/JAAR (5 dagen/week; 8 uur/dag)"},{"$f":"TRUNC(C7/2)","v":2085},{"$f":"D7","v":"uur/jaar"},null,{"$f":"language!A106","v":"GASTURBINE"},30,40,null,null,{"$f":"IF(language!A14=\"\",\"\",language!A14)","v":"TSJECHISCH"}]
[null,{"$f":"IF('Emission data'!H4<>\"\",CONCATENATE('Emission data'!H4,\" \",UPPER(language!A67)),CONCATENATE(UPPER(language!A101),IF(ISNUMBER(C9),CONCATENATE(\" (\",ROUND(C9,0),\" \",UPPER(D9),\")\"),\"\")))","v":"STAND-BY"},{"$f":"IF(OR('Emission data'!M22=0,'Emission data'!E5=0),\"\",(IF('Emission data'!E22=\"\",0,'Emission data'!E22)+IF('Emission data'!G22=\"\",0,'Emission data'!G22)+IF('Emission data'!I22=\"\",0,'Emission data'!I22)+IF('Emission data'!K22=\"\",0,'Emission data'!K22))*1000000/3600/'Emission data'!E5)","v":""},{"$f":"D8","v":"uur/jaar"},null,{"$f":"language!A107","v":"WKK GASTURBINE"},50,60,null,null,{"$f":"IF(language!A15=\"\",\"\",language!A15)","v":"BULGAARS"}]
[null,null,null,null,null,{"$f":"language!A108","v":"ZUIGERMOTOR"},35,45,null,null,{"$f":"IF(language!A16=\"\",\"\",language!A16)","v":"KROATISCH"}]
{"$rows_left_out":115}