{"text_format":"1","workbook":"xlsx","n_sheets":8,"sheets":["language","Handleiding validatie","Emission data","Gaseous fuels","Liquid fuels","Solid fuels","Validation test","Data"],"not_rendered":{"charts":0,"images":1,"macros":1,"external_links":0,"defined_names":51,"comments":2,"pivot_tables":0},"unopened":[],"bounds":{"document_bytes":16777216,"sheet_cells":100000,"rows_first":2000,"rows_last":500,"rows_between":2000,"halvings":0,"cell_chars":16384,"cell_head_chars":4096},"cells_cut":0,"cells_raw":0,"read":"whole","date_system":"1900"}

{"sheet":"language","index":0,"n_rows":252,"n_cols":10,"rows_kept":252,"cut":false,"hidden":true,"merged":[]}
["Current language choice",{"$f":"A11","v":"ENGELS"},{"$f":"A12","v":"NEDERLANDS"},{"$f":"A13","v":"POOLS"},{"$f":"IF(A14=\"\",\"--\",A14)","v":"TSJECHISCH"},{"$f":"IF(A15=\"\",\"--\",A15)","v":"BULGAARS"},{"$f":"IF(A16=\"\",\"--\",A16)","v":"KROATISCH"},{"$f":"IF(A17=\"\",\"--\",A17)","v":"DUITS"},{"$f":"IF(A18=\"\",\"--\",A18)","v":"FRANS"},{"$f":"IF(A19=\"\",\"--\",A19)","v":"--"}]
[{"$f":"IF(INDEX(B2:J2,Data!$K$4)=\"\",\"\",INDEX(B2:J2,Data!$K$4))","v":"Validatietest voor emissies naar lucht"},"Validation test for emission data","Validatietest voor emissies naar lucht","Test oceny danych emisyjnych","Ověřovací  test pro emisní  údaje","Тест за валидиране на данните за изпуснати емисии","Test provjere emisija u zrak"]
[{"$f":"IF(INDEX(B3:J3,Data!$K$4)=\"\",\"\",INDEX(B3:J3,Data!$K$4))","v":"Ondanks de zorgvuldigheid waarmee dit werkblad is opgesteld, zijn fouten niet uit te sluiten."},"Although this spreadsheet has been carefully developed, mistakes in the calculated values can not be excluded.","Ondanks de zorgvuldigheid waarmee dit werkblad is opgesteld, zijn fouten niet uit te sluiten.","Pomimo iż niniejszy arkusz został przygotowany ze szczególną starannością, nie można wykluczyć błędów kalkulacyjnych.","přestože byl tento tabulkový procesor pečlivě připravován, nelze vyloučit chyby ve vypočítaných hodnotách.","Въпреки че тази програма е била разработен много внимателно, може да има допуснати някои грешки в изчислените стойности.","Ova verzija je pažljivo razvijena, nepredviđene pogreške su moguće."]
[{"$f":"IF(INDEX(B4:J4,Data!$K$4)=\"\",\"\",INDEX(B4:J4,Data!$K$4))","v":"Versie"},"Version","Versie","Wersja","Verze ","Вариант ","Verzija "]
[{"$f":"IF(INDEX(B5:J5,Data!$K$4)=\"\",\"\",INDEX(B5:J5,Data!$K$4))","v":"Deze versie is te gebruiken tot "},"This version can be used until","Deze versie is te gebruiken tot "]
[{"$f":"IF(INDEX(B6:J6,Data!$K$4)=\"\",\"\",INDEX(B6:J6,Data!$K$4))","v":"Deze versie is verlopen; download een nieuwe versie van www.InfoMil.nl"},"This version is outdated, download the last version from www.InfoMil.nl","Deze versie is verlopen; download een nieuwe versie van www.InfoMil.nl"]
[{"$f":"IF(INDEX(B7:J7,Data!$K$4)=\"\",\"\",INDEX(B7:J7,Data!$K$4))","v":"Afwijkend van verwachtingswaarde"},"Different from expected value","Afwijkend van verwachtingswaarde","odbiegające od oczekiwanej wartości ","Odlišné od očekávané hodnoty","Различно от очакваната стойност","Različito od očekivane vrijednosti "]
[{"$f":"IF(INDEX(B8:J8,Data!$K$4)=\"\",\"\",INDEX(B8:J8,Data!$K$4))","v":"Ok"},"Okay","Ok","Ok","Ok","Ok","U redu"]
[{"$f":"IF(INDEX(B9:J9,Data!$K$4)=\"\",\"\",INDEX(B9:J9,Data!$K$4))","v":"Nm3: m3 onder standaard condities"},"Nm3: m3 at standard conditions","Nm3: m3 onder standaard condities","Nm3: m3 w warunkach normalnych ","Nm3: m3 za normálních podmínek","Nm3: m3 в нормални условия","Nm3: m3 u standardnim uvjetima"]
[{"$f":"IF(INDEX(B10:J10,Data!$K$4)=\"\",\"\",INDEX(B10:J10,Data!$K$4))","v":"Taal"},"Language","Taal","Język","Jazyk","Език","Jezik"]
[{"$f":"IF(INDEX(B11:J11,Data!$K$4)=\"\",\"\",INDEX(B11:J11,Data!$K$4))","v":"ENGELS"},"ENGLISH","ENGELS","ANGIELSKI","ANGLIČTINA","Английски","ENGLESKI"]
[{"$f":"IF(INDEX(B12:J12,Data!$K$4)=\"\",\"\",INDEX(B12:J12,Data!$K$4))","v":"NEDERLANDS"},"DUTCH","NEDERLANDS","HOLENDERSKI","HOLANDŠTINA","Холандски","NIZOZEMSKI"]
[{"$f":"IF(INDEX(B13:J13,Data!$K$4)=\"\",\"\",INDEX(B13:J13,Data!$K$4))","v":"POOLS"},"POLISH","POOLS","POLSKI","POLŠTINA","Полски","POLJSKI"]
[{"$f":"IF(INDEX(B14:J14,Data!$K$4)=\"\",\"\",INDEX(B14:J14,Data!$K$4))","v":"TSJECHISCH"},"CZECH","TSJECHISCH","CZESKI","ČEŠTINA","Чешки","ČEŠKI"]
[{"$f":"IF(INDEX(B15:J15,Data!$K$4)=\"\",\"\",INDEX(B15:J15,Data!$K$4))","v":"BULGAARS"},"BULGARIAN","BULGAARS","BUŁGARSKI","BULHARŠTINA","Български","BUGARSKI"]
[{"$f":"IF(INDEX(B16:J16,Data!$K$4)=\"\",\"\",INDEX(B16:J16,Data!$K$4))","v":"KROATISCH"},"CROATIAN","KROATISCH",null,null,null,"HRVATSKI"]
[{"$f":"IF(INDEX(B17:J17,Data!$K$4)=\"\",\"\",INDEX(B17:J17,Data!$K$4))","v":"DUITS"},"GERMAN","DUITS","NIEMIECKI","NĚMČINA","Немски","NJEMAČKI"]
[{"$f":"IF(INDEX(B18:J18,Data!$K$4)=\"\",\"\",INDEX(B18:J18,Data!$K$4))","v":"FRANS"},"FRENCH","FRANS","FRANCUSKI","FRANCOUZŠTINA","Френски","FRANCUSKI"]
[{"$f":"IF(INDEX(B19:J19,Data!$K$4)=\"\",IF(B19=\"\",\"\",B19),INDEX(B19:J19,Data!$K$4))","v":""}]
[{"$f":"IF(INDEX(B20:J20,Data!$K$4)=\"\",\"\",INDEX(B20:J20,Data!$K$4))","v":"Installatie/eenheid"},"Installation/unit","Installatie/eenheid","Instalacja/urządzenie","Zařízení/jednotka","Инсталация/звено","Podaci o ispustu/uređaja"]
[{"$f":"IF(INDEX(B21:J21,Data!$K$4)=\"\",\"\",INDEX(B21:J21,Data!$K$4))","v":"Type"},"Type","Type","Typ","Typ","Вид","Vrsta"]
[{"$f":"IF(INDEX(B22:J22,Data!$K$4)=\"\",\"\",INDEX(B22:J22,Data!$K$4))","v":"Thermisch vermogen"},"Thermal capacity","Thermisch vermogen","Wydajność cieplna","Tepelný výkon","Топлинна мощност","Nazivna toplinska snaga "]
[{"$f":"IF(INDEX(B23:J23,Data!$K$4)=\"\",\"\",INDEX(B23:J23,Data!$K$4))","v":"Elektrisch rendement"},"Electrical efficiency","Elektrisch rendement","Wydajność elektryczna","Elektrická účinnost","КПД","Električni stupanj djelovanja"]
[{"$f":"IF(INDEX(B24:J24,Data!$K$4)=\"\",\"\",INDEX(B24:J24,Data!$K$4))","v":"Elektrische belasting"},"E-load","Elektrische belasting","E-ładunek","E-zatížení","Електронатоварване","El. kapacitet"]
[{"$f":"IF(INDEX(B25:J25,Data!$K$4)=\"\",\"\",INDEX(B25:J25,Data!$K$4))","v":"Max. stoomproductie"},"Max. steam production","Max. stoomproductie","Max. produkcja pary","Max. produkce páry","Максимално производство на пара","Max. nastanak pare"]
[{"$f":"IF(INDEX(B26:J26,Data!$K$4)=\"\",\"\",INDEX(B26:J26,Data!$K$4))","v":"Bedrijfsvoering"},"Operation of installation/unit","Bedrijfsvoering","Działanie instalacji/urządzenia","Provoz zařízení/jednotky","Експлоатация на инсталацията/звеното","Period rada"]
[{"$f":"IF(INDEX(B27:J27,Data!$K$4)=\"\",\"\",INDEX(B27:J27,Data!$K$4))","v":"Brandstof"},"Fuel","Brandstof","Paliwo","Palivo","Гориво","Gorivo "]
[{"$f":"IF(INDEX(B28:J28,Data!$K$4)=\"\",\"\",INDEX(B28:J28,Data!$K$4))","v":"AARDGAS"},"NATURAL GAS","AARDGAS","NATURAL GAS","NATURAL GAS","ПРИРОДЕН ГАЗ","ZEMNI ILI PRIRODNI PLIN"]
[{"$f":"IF(INDEX(B29:J29,Data!$K$4)=\"\",\"\",INDEX(B29:J29,Data!$K$4))","v":"DIESEL"},"DIESEL","DIESEL","DIESEL","DIESEL","ДИЗЕЛ","TEKUĆE GORIVO"]
[{"$f":"IF(INDEX(B30:J30,Data!$K$4)=\"\",\"\",INDEX(B30:J30,Data!$K$4))","v":"HFO"},"HFO","HFO","HFO","HFO","МАЗУТ","TEŠKO LOŽIVO ULJE"]
[{"$f":"IF(INDEX(B31:J31,Data!$K$4)=\"\",\"\",INDEX(B31:J31,Data!$K$4))","v":"LFO"},"LFO","LFO","LFO","LFO","НАФТА","LUEL"]
[{"$f":"IF(INDEX(B32:J32,Data!$K$4)=\"\",\"\",INDEX(B32:J32,Data!$K$4))","v":"KOLEN"},"COAL","KOLEN","COAL","COAL","ВЪГЛИЩА","UGLJEN"]
[{"$f":"IF(INDEX(B33:J33,Data!$K$4)=\"\",\"\",INDEX(B33:J33,Data!$K$4))","v":"Berekeningsmethode"},"Calculation principle","Berekeningsmethode","Zasada obliczeń","Pravidlo pro výpočet","Начин на изчисление","Metoda izračuna"]
[{"$f":"IF(INDEX(B34:J34,Data!$K$4)=\"\",\"\",INDEX(B34:J34,Data!$K$4))","v":"Onderste verbrandingswaarde"},"Lower heating value","Onderste verbrandingswaarde","Najniższa wartość opałowa","Spodní výhřevnost","Долно ниво на калоричност ","Donja toplinska vrijednost"]
[{"$f":"IF(INDEX(B35:J35,Data!$K$4)=\"\",\"\",INDEX(B35:J35,Data!$K$4))","v":"Bovenste verbrandingswaarde"},"Upper heating value","Bovenste verbrandingswaarde","Najwyższa wartość opałowa","Horní výhřevnost","Горно ниво на калоричност","Gornja toplinska vrijednost"]
[{"$f":"IF(INDEX(B36:J36,Data!$K$4)=\"\",\"\",INDEX(B36:J36,Data!$K$4))","v":"Wobbe-index"},"Wobbe-index","Wobbe-index","Wskaźnik Wobbe'a","Wobbeho index","Wobbe-индекс","Wobbe-indeks"]
[{"$f":"IF(INDEX(B37:J37,Data!$K$4)=\"\",\"\",INDEX(B37:J37,Data!$K$4))","v":"O2"},"O2","O2","O2","O2","O2","O2"]
[{"$f":"IF(INDEX(B38:J38,Data!$K$4)=\"\",\"\",INDEX(B38:J38,Data!$K$4))","v":"SO2"},"SO2","SO2","SO2","SO2","SO2","SO2"]
[{"$f":"IF(INDEX(B39:J39,Data!$K$4)=\"\",\"\",INDEX(B39:J39,Data!$K$4))","v":"CO2"},"CO2","CO2","CO2","CO2","CO2","CO2"]
[{"$f":"IF(INDEX(B40:J40,Data!$K$4)=\"\",\"\",INDEX(B40:J40,Data!$K$4))","v":"NOx"},"NOx","NOx","NOx","NOx","NOx","NOx"]
[{"$f":"IF(INDEX(B41:J41,Data!$K$4)=\"\",\"\",INDEX(B41:J41,Data!$K$4))","v":"H2O"},"H2O","H2O","H2O","H2O","H2O","H2O"]
[{"$f":"IF(INDEX(B42:J42,Data!$K$4)=\"\",\"\",INDEX(B42:J42,Data!$K$4))","v":"Stoichiometrisch luchtverbruik"},"Stoichiometric air demand","Stoichiometrisch luchtverbruik","Stechiometryczne zapotrzebowanie na tlen","Stechiometrická spotřeba vzduchu","Стохиометрична нужда от кислород","Stehiomet.kol. zraka potrebna za izgaranje"]
[{"$f":"IF(INDEX(B43:J43,Data!$K$4)=\"\",\"\",INDEX(B43:J43,Data!$K$4))","v":"Droog luchtverbruik"},"Dry air demand","Droog luchtverbruik","Zapotrzebowanie na powietrze w stanie suchym","Spotřeba suchého vzduchu","Нужда от сух въздух","Potrebna kol. suhog zraka"]
[{"$f":"IF(INDEX(B44:J44,Data!$K$4)=\"\",\"\",INDEX(B44:J44,Data!$K$4))","v":"Stoichiometrisch rookgasvolume (droog)"},"Stoichiometric flue gas flow (dry)","Stoichiometrisch rookgasvolume (droog)","Stechiometryczny przepływ spalin (suchych)","Stechiometrický průtok kouřového plynu (suchého)","Стохиомет. дебит на димни газове (сухи)","Stehiomet.protok dimnih plinova (suhi)"]
[{"$f":"IF(INDEX(B45:J45,Data!$K$4)=\"\",\"\",INDEX(B45:J45,Data!$K$4))","v":"Stoichiometrisch rookgasvolume"},"Stoichiometric flue gas flow","Stoichiometrisch rookgasvolume","Stechiometryczny przepływ spalin","Stechiometrický průtok kouřového plynu ","Стохиометричен дебит на димни газове","Stehiomet.protok dimnih plinova"]
[{"$f":"IF(INDEX(B46:J46,Data!$K$4)=\"\",\"\",INDEX(B46:J46,Data!$K$4))","v":"droog"},"dry","droog","suchych","suchý","сух","suhi"]
[{"$f":"IF(INDEX(B47:J47,Data!$K$4)=\"\",\"\",INDEX(B47:J47,Data!$K$4))","v":"nat"},"wet","nat","mokrych","mokrý","влажен","mokri"]
[{"$f":"IF(INDEX(B48:J48,Data!$K$4)=\"\",\"\",INDEX(B48:J48,Data!$K$4))","v":"Toepassing"},"Application","Toepassing","Zastosowanie","Použití","Вид","Primjena goriva"]
[{"$f":"IF(INDEX(B49:J49,Data!$K$4)=\"\",\"\",INDEX(B49:J49,Data!$K$4))","v":"Verbruik"},"Consumption","Verbruik","Zużycie","Spotřeba","Потребление","Utrošak goriva"]
[{"$f":"IF(INDEX(B50:J50,Data!$K$4)=\"\",\"\",INDEX(B50:J50,Data!$K$4))","v":"Energieverbruik"},"Energy consumption","Energieverbruik","Zużycie energii","Spotřeba energie","Потребление на енергия","Utrošak energije"]
[{"$f":"IF(INDEX(B51:J51,Data!$K$4)=\"\",\"\",INDEX(B51:J51,Data!$K$4))","v":"Gemiddelde belasting"},"Average load","Gemiddelde belasting","Średnie obciążenie","Průměrné zatížení","Средно натоварване","Prosječan utrošak goriva"]
[{"$f":"IF(INDEX(B52:J52,Data!$K$4)=\"\",\"\",INDEX(B52:J52,Data!$K$4))","v":"Gehalte fossiele brandstof"},"Percentage fossile fuel","Gehalte fossiele brandstof","Procent paliwa kopalnego","Procento fosilního paliva","Процент изкопаемо гориво","Postotak fosilnog goriva"]
[{"$f":"IF(INDEX(B53:J53,Data!$K$4)=\"\",\"\",INDEX(B53:J53,Data!$K$4))","v":"voor handel"},"for trading","voor handel","objętego handlem","pro obchodování","за продажба","za prodaju"]
[{"$f":"IF(INDEX(B54:J54,Data!$K$4)=\"\",\"\",INDEX(B54:J54,Data!$K$4))","v":"Rookgas"},"Flue gas","Rookgas","Spaliny","Kouřový plyn","Димни газове","dimni plinovi"]
[{"$f":"IF(INDEX(B55:J55,Data!$K$4)=\"\",\"\",INDEX(B55:J55,Data!$K$4))","v":"Concentratie in droog rookgas"},"Concentration in dry flue gas","Concentratie in droog rookgas","Stężenie w suchych spalinach","Koncentrace v kouřovém plynu","Концентрация в сухи димни газове","Koncentracija u suhim dimnim plinovima"]
[{"$f":"IF(INDEX(B56:J56,Data!$K$4)=\"\",\"\",INDEX(B56:J56,Data!$K$4))","v":"Emissie"},"Emission","Emissie","Emisja","Emise","Емисии","Količina emisije"]
[{"$f":"IF(INDEX(B57:J57,Data!$K$4)=\"\",\"\",INDEX(B57:J57,Data!$K$4))","v":"Rookgasdebiet (droog)"},"Flue gas flow (dry)","Rookgasdebiet (droog)","Przepływ spalin (suchych)","Průtok kouřového plynu (suchého)","Дебит на димни газове (сухи)","Protok dimnih plinova (suhi)"]
[{"$f":"IF(INDEX(B58:J58,Data!$K$4)=\"\",\"\",INDEX(B58:J58,Data!$K$4))","v":"Rookgasdebiet (nat)"},"Flue gas flow (wet)","Rookgasdebiet (nat)","Przepływ spalin (mokrych)","Průtok kouřového plynu (mokrého)","Дебит на димни газове (влажни)","Protok dimnih plinova (mokri)"]
[{"$f":"IF(INDEX(B59:J59,Data!$K$4)=\"\",\"\",INDEX(B59:J59,Data!$K$4))","v":"Debiet (droog)"},"Gas flow (dry)","Debiet (droog)","Przepływ (suchych)","Průtok plynu (suchého)","Дебит на газове (сухи)","Protok plina (ostali suhi plinovi)"]
[{"$f":"IF(INDEX(B60:J60,Data!$K$4)=\"\",\"\",INDEX(B60:J60,Data!$K$4))","v":"Invoer emissiegegevens"},"Input emission data","Invoer emissiegegevens","Wejścowe dane emisyjne","Vložení emisních údajů","Въвеждане на данни за изпуснати емисии","Unos vrijednosti emisije"]
[{"$f":"IF(INDEX(B61:J61,Data!$K$4)=\"\",\"\",INDEX(B61:J61,Data!$K$4))","v":"Validatietest"},"Validation test","Validatietest","Test oceny","Ověřovací test","Тест за валидиране ","Test provjere "]
[{"$f":"IF(INDEX(B62:J62,Data!$K$4)=\"\",\"\",INDEX(B62:J62,Data!$K$4))","v":"Wijzig gegevens gasvormige brandstoffen"},"Change gaseous fuel data","Wijzig gegevens gasvormige brandstoffen","Zmiana danych dot. paliw gaz.","Změna údajů o plynném palivu","Промяна в данните за газообразно гориво","Izmijeni podatke o plinovitom gorivu"]
[{"$f":"IF(INDEX(B63:J63,Data!$K$4)=\"\",\"\",INDEX(B63:J63,Data!$K$4))","v":"Wijzig gegevens vloeibare brandstoffen"},"Change liquid fuel data","Wijzig gegevens vloeibare brandstoffen","Zmiana danych dot. paliw płyn.","Změna údajů o tekutém palivu","Промяна в данните за течно гориво","Izmijeni podatke o tekućem gorivu"]
[{"$f":"IF(INDEX(B64:J64,Data!$K$4)=\"\",\"\",INDEX(B64:J64,Data!$K$4))","v":"Wijzig gegevens vaste brandstoffen"},"Change solid fuel data","Wijzig gegevens vaste brandstoffen","Zmiana danych dot. paliw stał.","Změna údajů o pevném palivu","Промяна в данните за твърдо гориво","Izmijeni podatke o krutom gorivu"]
[{"$f":"IF(INDEX(B65:J65,Data!$K$4)=\"\",\"\",INDEX(B65:J65,Data!$K$4))","v":"MW"},"MW","MW","MW","MW","MW","MW"]
[{"$f":"IF(INDEX(B66:J66,Data!$K$4)=\"\",\"\",INDEX(B66:J66,Data!$K$4))","v":"ton/uur"},"tons/hour","ton/uur","ton/godz","tuna/hod","tons/час","t/h"]
[{"$f":"IF(INDEX(B67:J67,Data!$K$4)=\"\",\"\",INDEX(B67:J67,Data!$K$4))","v":"uur/jaar"},"hours/year","uur/jaar","godz/rok","hod/rok","часове/год","sati/god."]
[{"$f":"IF(INDEX(B68:J68,Data!$K$4)=\"\",\"\",INDEX(B68:J68,Data!$K$4))","v":"Totaal"},"Total","Totaal","Razem","Celkem","Общо","Ukupno"]
[{"$f":"IF(INDEX(B69:J69,Data!$K$4)=\"\",\"\",INDEX(B69:J69,Data!$K$4))","v":"MJ"},"MJ","MJ","MJ","MJ","MJ","MJ"]
[{"$f":"IF(INDEX(B70:J70,Data!$K$4)=\"\",\"\",INDEX(B70:J70,Data!$K$4))","v":"MJ/Nm3"},"MJ/Nm3","MJ/Nm3","MJ/Nm3","MJ/m3","MJ/Nm3","MJ/Nm3"]
[{"$f":"IF(INDEX(B71:J71,Data!$K$4)=\"\",\"\",INDEX(B71:J71,Data!$K$4))","v":"kJ/Nm3"},"kJ/Nm3","kJ/Nm3","kJ/Nm3","kJ/Nm3","kJ/Nm3","kJ/Nm3"]
[{"$f":"IF(INDEX(B72:J72,Data!$K$4)=\"\",\"\",INDEX(B72:J72,Data!$K$4))","v":"MJ/kg"},"MJ/kg","MJ/kg","MJ/kg","MJ/kg","MJ/kg","MJ/kg"]
[{"$f":"IF(INDEX(B73:J73,Data!$K$4)=\"\",\"\",INDEX(B73:J73,Data!$K$4))","v":"kJ/kg"},"kJ/kg","kJ/kg","kJ/kg","kJ/kg","kJ/kg","kJ/kg"]
[{"$f":"IF(INDEX(B74:J74,Data!$K$4)=\"\",\"\",INDEX(B74:J74,Data!$K$4))","v":"MJ/kmol"},"MJ/kmol","MJ/kmol","MJ/kmol","MJ/kmol","MJ/kmol","MJ/kmol"]
[{"$f":"IF(INDEX(B75:J75,Data!$K$4)=\"\",\"\",INDEX(B75:J75,Data!$K$4))","v":"mol/kg"},"mol/kg","mol/kg","mol/kg","mol/kg","mol/kg","mol/kg"]
[{"$f":"IF(INDEX(B76:J76,Data!$K$4)=\"\",\"\",INDEX(B76:J76,Data!$K$4))","v":"kg/GJ"},"kg/GJ","kg/GJ","kg/GJ","kg/GJ","kg/GJ","kg/GJ"]
[{"$f":"IF(INDEX(B77:J77,Data!$K$4)=\"\",\"\",INDEX(B77:J77,Data!$K$4))","v":"kg CO2/GJ"},"kg CO2/GJ","kg CO2/GJ","kg CO2/GJ","kg CO2/GJ","kg CO2/GJ","kg CO2/GJ"]
[{"$f":"IF(INDEX(B78:J78,Data!$K$4)=\"\",\"\",INDEX(B78:J78,Data!$K$4))","v":"kg/Nm3"},"kg/Nm3","kg/Nm3","kg/Nm3","kg/m3","kg/Nm3","kg/Nm3"]
[{"$f":"IF(INDEX(B79:J79,Data!$K$4)=\"\",\"\",INDEX(B79:J79,Data!$K$4))","v":"Nm3"},"Nm3","Nm3","Nm3","m3","Nm3","Nm3"]
[{"$f":"IF(INDEX(B80:J80,Data!$K$4)=\"\",\"\",INDEX(B80:J80,Data!$K$4))","v":"Nm3/Nm3"},"Nm3/Nm3","Nm3/Nm3","Nm3/Nm3","m3/m3","Nm3/Nm3","Nm3/Nm3"]
[{"$f":"IF(INDEX(B81:J81,Data!$K$4)=\"\",\"\",INDEX(B81:J81,Data!$K$4))","v":"Nm3/kg"},"Nm3/kg","Nm3/kg","Nm3/kg","m3/kg","Nm3/kg","Nm3/kg"]
[{"$f":"IF(INDEX(B82:J82,Data!$K$4)=\"\",\"\",INDEX(B82:J82,Data!$K$4))","v":"Nm3/jaar"},"Nm3/year","Nm3/jaar","Nm3/rok","m3/rok","Nm3/год","Nm3/god."]
[{"$f":"IF(INDEX(B83:J83,Data!$K$4)=\"\",\"\",INDEX(B83:J83,Data!$K$4))","v":"kg/jaar"},"kg/year","kg/jaar","kg/rok","kg/rok","kg/год","kg/god."]
[{"$f":"IF(INDEX(B84:J84,Data!$K$4)=\"\",\"\",INDEX(B84:J84,Data!$K$4))","v":"Nm3/uur"},"Nm3/hour","Nm3/uur","Nm3/godz","m3/hod","Nm3/час","Nm3/h"]
[{"$f":"IF(INDEX(B85:J85,Data!$K$4)=\"\",\"\",INDEX(B85:J85,Data!$K$4))","v":"kg/uur"},"kg/hour","kg/uur","kg/godz","kg/hod","kg/час","kg/h"]
[{"$f":"IF(INDEX(B86:J86,Data!$K$4)=\"\",\"\",INDEX(B86:J86,Data!$K$4))","v":"GJ/uur"},"GJ/hour","GJ/uur","GJ/godz","GJ/hod","GJ/час","GJ/h"]
[{"$f":"IF(INDEX(B87:J87,Data!$K$4)=\"\",\"\",INDEX(B87:J87,Data!$K$4))","v":"TJ/jaar"},"TJ/year","TJ/jaar","TJ/rok","TJ/rok","TJ/год","TJ/god."]
[{"$f":"IF(INDEX(B88:J88,Data!$K$4)=\"\",\"\",INDEX(B88:J88,Data!$K$4))","v":"ton/uur"},"tons/hour","ton/uur","ton/godz","tuny/hod","tоns/час","t/h"]
[{"$f":"IF(INDEX(B89:J89,Data!$K$4)=\"\",\"\",INDEX(B89:J89,Data!$K$4))","v":"ton/jaar"},"tons/year","ton/jaar","ton/rok","tuny/rok","tоns/год","t/god."]
[{"$f":"IF(INDEX(B90:J90,Data!$K$4)=\"\",\"\",INDEX(B90:J90,Data!$K$4))","v":"kton/jaar"},"ktons/year","kton/jaar","kton/rok","kilotuny/rok","ktons/год","kt/god."]
[{"$f":"IF(INDEX(B91:J91,Data!$K$4)=\"\",\"\",INDEX(B91:J91,Data!$K$4))","v":"vol%"},"vol%","vol%","vol%","objem %","обем %","vol%"]
[{"$f":"IF(INDEX(B92:J92,Data!$K$4)=\"\",\"\",INDEX(B92:J92,Data!$K$4))","v":"Nm3/jaar"},"Nm3/year","Nm3/jaar","Nm3/rok","m3/rok","Nm3/год","Nm3/god."]
[{"$f":"IF(INDEX(B93:J93,Data!$K$4)=\"\",\"\",INDEX(B93:J93,Data!$K$4))","v":"mg/Nm3"},"mg/Nm3","mg/Nm3","mg/Nm3","mg/m3","mg/Nm3","mg/Nm3"]
[{"$f":"IF(INDEX(B94:J94,Data!$K$4)=\"\",\"\",INDEX(B94:J94,Data!$K$4))","v":"bij"},"at","bij","w","v","при","na/u"]
[{"$f":"IF(INDEX(B95:J95,Data!$K$4)=\"\",\"\",INDEX(B95:J95,Data!$K$4))","v":"kg/GJ"},"kg/GJ","kg/GJ","kg/GJ","kg/GJ","kg/GJ","kg/GJ"]
[{"$f":"IF(INDEX(B96:J96,Data!$K$4)=\"\",\"\",INDEX(B96:J96,Data!$K$4))","v":"g/GJ"},"g/GJ","g/GJ","g/GJ","g/GJ","g/GJ","g/GJ"]
[{"$f":"IF(INDEX(B97:J97,Data!$K$4)=\"\",\"\",INDEX(B97:J97,Data!$K$4))","v":"Geldigheid"},"Validity","Geldigheid","Okres ważności'","Správnost","Валидност","Valjanost"]
[{"$f":"IF(INDEX(B98:J98,Data!$K$4)=\"\",\"\",INDEX(B98:J98,Data!$K$4))","v":"Menu"},"Menu","Menu","Menu","Menu","Меню","Menu"]
[{"$f":"IF(INDEX(B99:J99,Data!$K$4)=\"\",\"\",INDEX(B99:J99,Data!$K$4))","v":"DAGEN/WEEK"},"DAYS/WEEK","DAGEN/WEEK","DNI/TYDZ","DNY/TÝDEN","ДНИ/СЕДМИЦА","DANI/TJEDAN"]
[{"$f":"IF(INDEX(B100:J100,Data!$K$4)=\"\",\"\",INDEX(B100:J100,Data!$K$4))","v":"UUR/DAG"},"HR/DAY","UUR/DAG","GODZ/DZIEŃ","HOD/DEN","ЧАСА/ДЕН","SATI/DAN"]
[{"$f":"IF(INDEX(B101:J101,Data!$K$4)=\"\",\"\",INDEX(B101:J101,Data!$K$4))","v":"STAND-BY"},"STAND-BY","STAND-BY","JEDN.ZAPASOWA/STAND-BY","POHOTOVOST","ПОСТОЯННО","STAND-BY"]
[{"$f":"IF(INDEX(B102:J102,Data!$K$4)=\"\",\"\",INDEX(B102:J102,Data!$K$4))","v":"Installatie type"},"Installation type","Installatie type","Instalacji typ","Typ zařízení","Вид инсталация","Vrsta ispusta"]
[{"$f":"IF(INDEX(B103:J103,Data!$K$4)=\"\",\"\",INDEX(B103:J103,Data!$K$4))","v":"KETEL"},"BOILER","KETEL","KOCIOŁ","KOTEL","КОТЕЛ","KOTAO"]
[{"$f":"IF(INDEX(B104:J104,Data!$K$4)=\"\",\"\",INDEX(B104:J104,Data!$K$4))","v":"KETEL MET STOOMTURBINE"},"BOILER WITH STEAMTURBINE","KETEL MET STOOMTURBINE","KOCIOŁ Z TURBINĄ PAROWĄ","KOTEL S PARNÍ TURBÍNOU","КОТЕЛ С ПАРНА ТУРБИНА","KOTAO PARNE TURBINE"]
[{"$f":"IF(INDEX(B105:J105,Data!$K$4)=\"\",\"\",INDEX(B105:J105,Data!$K$4))","v":"PROCESFORNUIS"},"FURNACE","PROCESFORNUIS","PIEC","PEC","ПЕЩ","LOŽIŠTE"]
[{"$f":"IF(INDEX(B106:J106,Data!$K$4)=\"\",\"\",INDEX(B106:J106,Data!$K$4))","v":"GASTURBINE"},"GAS TURBINE","GASTURBINE","TURBINA GAZOWA","PLYNOVÁ TURBÍNA","ГАЗОВА ТУРБИНА","PLINSKA TURBINA"]
[{"$f":"IF(INDEX(B107:J107,Data!$K$4)=\"\",\"\",INDEX(B107:J107,Data!$K$4))","v":"WKK GASTURBINE"},"CHP GAS TURBINE","WKK GASTURBINE","TURBINA GAZOWA KOGENERACYJNA (CHP)","CHP PLYNOVÁ TURBÍNA","ГАЗОВА ТУРБИНА ЗА КОМБИНИРАНО ТОПЛО И ЕЛЕКТРО ПРОИЗВОДСТВО","KOMBINIRANA EL./PLINSKA TURBINA"]
[{"$f":"IF(INDEX(B108:J108,Data!$K$4)=\"\",\"\",INDEX(B108:J108,Data!$K$4))","v":"ZUIGERMOTOR"},"ENGINE","ZUIGERMOTOR","SILNIK","MOTOR","ДВИГАТЕЛ","MOTOR SA UNUTARNJIM IZGARANJEM"]
[{"$f":"IF(INDEX(B109:J109,Data!$K$4)=\"\",\"\",INDEX(B109:J109,Data!$K$4))","v":"WKK ZUIGERMOTOR"},"CHP ENGINE","WKK ZUIGERMOTOR","SILNIK KOGENERACYJNY (CHP)","CHP MOTOR","ДВИГАТЕЛ ЗА КОМБИНИРАНО ТОПЛО И ЕЛЕКТРО ПРОИЗВОДСТВО","KOMBINIRANI EL./PLINSKI MOTOR"]
[{"$f":"IF(INDEX(B110:J110,Data!$K$4)=\"\",\"\",INDEX(B110:J110,Data!$K$4))","v":"ANDERS"},"OTHER","ANDERS","INNE","JINÉ ","ДРУГ","OSTALO"]
[{"$f":"IF(INDEX(B111:J111,Data!$K$4)=\"\",\"\",INDEX(B111:J111,Data!$K$4))","v":"Min rendement"},"Min Efficiency","Min rendement","Min. wydajność","Min účinnost","Минимално ниво на ефективност","Min. učinkovitost"]
[{"$f":"IF(INDEX(B112:J112,Data!$K$4)=\"\",\"\",INDEX(B112:J112,Data!$K$4))","v":"Max rendement"},"Max Efficiency","Max rendement","Max. wydajność","Max účinnost","Максимално ниво на ефективност","Max. učinkovitost"]
[{"$f":"IF(INDEX(B113:J113,Data!$K$4)=\"\",\"\",INDEX(B113:J113,Data!$K$4))","v":"rij"},"row","rij","wiersz","řada","ред","red"]
[{"$f":"IF(INDEX(B114:J114,Data!$K$4)=\"\",\"\",INDEX(B114:J114,Data!$K$4))","v":"kolom"},"column","kolom","kolumna","sloupec","колона","kolona"]
[{"$f":"IF(INDEX(B115:J115,Data!$K$4)=\"\",\"\",INDEX(B115:J115,Data!$K$4))","v":"brandstoftype"},"fuel type","brandstoftype","Typ paliwa","Typ paliva","вид гориво","vrsta goriva"]
[{"$f":"IF(INDEX(B116:J116,Data!$K$4)=\"\",\"\",INDEX(B116:J116,Data!$K$4))","v":"GEEN"},"NONE","GEEN","-","ŽÁDNÉ","НИЩО","NEMA"]
[{"$f":"IF(INDEX(B117:J117,Data!$K$4)=\"\",\"\",INDEX(B117:J117,Data!$K$4))","v":"% fossiel"},"% fossile","% fossiel","% paliwa kopalnego","% fosilního (paliva)","% фосил","% fosilnog goriva"]
[{"$f":"IF(INDEX(B118:J118,Data!$K$4)=\"\",\"\",INDEX(B118:J118,Data!$K$4))","v":"Onderste verbrandingswaarde"},"Lower heating value","Onderste verbrandingswaarde","Najniższa wartość opałowa","Hodnota spodní výhřevnosti","Долно ниво на калоричност ","Donja toplinska vrijednost"]
[{"$f":"IF(INDEX(B119:J119,Data!$K$4)=\"\",\"\",INDEX(B119:J119,Data!$K$4))","v":"Berekeningsmethode"},"Calculation principle","Berekeningsmethode","Zasada obliczeń","Pravidlo pro výpočet","Начин на изчисление","Metoda izračuna"]
[{"$f":"IF(INDEX(B120:J120,Data!$K$4)=\"\",\"\",INDEX(B120:J120,Data!$K$4))","v":"Stoichiometrisch rookgasvolume Rgv"},"Stoichiometric flue gas flow ","Stoichiometrisch rookgasvolume Rgv","Stechiometryczny przepływ spalin","stechiometrický průtok kouřového plynu Rgv","Стохиометричен дебит на димни газове Rgv","Stehiomet.protok dimnih plinova "]
[{"$f":"IF(INDEX(B121:J121,Data!$K$4)=\"\",\"\",INDEX(B121:J121,Data!$K$4))","v":"onzekerheid"},"uncertainty","onzekerheid","niepewność","nejistota","несигурност","odstupanje"]
[{"$f":"IF(INDEX(B122:J122,Data!$K$4)=\"\",\"\",INDEX(B122:J122,Data!$K$4))","v":"eenheid"},"unit","eenheid","jednostka","jednotka","звено","jedinica"]
[{"$f":"IF(INDEX(B123:J123,Data!$K$4)=\"\",\"\",INDEX(B123:J123,Data!$K$4))","v":"VERBRANDING"},"COMBUSTION","VERBRANDING","SPALANIE","SPALOVÁNÍ","ГОРЕНЕ","IZGARANJE"]
[{"$f":"IF(INDEX(B124:J124,Data!$K$4)=\"\",\"\",INDEX(B124:J124,Data!$K$4))","v":"LEVERING"},"SUPPLY","LEVERING","DOSTAWA","DODÁVKA","ДОСТАВКА","PRODANO"]
[{"$f":"IF(INDEX(B125:J125,Data!$K$4)=\"\",\"\",INDEX(B125:J125,Data!$K$4))","v":"HF"},"HF","HF","HF","HF","HF","HF"]
[{"$f":"IF(INDEX(B126:J126,Data!$K$4)=\"\",\"\",INDEX(B126:J126,Data!$K$4))","v":"HCl"},"HCl","HCl","HCl","HCl","HCl","HCl"]
[{"$f":"IF(INDEX(B127:J127,Data!$K$4)=\"\",\"\",INDEX(B127:J127,Data!$K$4))","v":"CxHy"},"CxHy","CxHy","CxHy","CxHy","CxHy","CxHy"]
[{"$f":"IF(INDEX(B128:J128,Data!$K$4)=\"\",\"\",INDEX(B128:J128,Data!$K$4))","v":"CO"},"CO","CO","CO","CO","CO","CO"]
[{"$f":"IF(INDEX(B129:J129,Data!$K$4)=\"\",\"\",INDEX(B129:J129,Data!$K$4))","v":"STOF"},"DUST","STOF","PYŁ","PRACH","ПРАХ","PRAŠINA"]
[{"$f":"IF(INDEX(B130:J130,Data!$K$4)=\"\",\"\",INDEX(B130:J130,Data!$K$4))","v":"Score"},"Score","Score","Wynik","Skóre","Резултат","Rezultat"]
[{"$f":"IF(INDEX(B131:J131,Data!$K$4)=\"\",\"\",INDEX(B131:J131,Data!$K$4))","v":"Stoomproductie"},"Steam production","Stoomproductie","Produkcja pary","Produkce páry","Производство на пара","Nastala para"]
[{"$f":"IF(INDEX(B132:J132,Data!$K$4)=\"\",\"\",INDEX(B132:J132,Data!$K$4))","v":"niet relevant/onbekend"},"not relevant/unknown","niet relevant/onbekend","nie dotyczy/ nieznane","není relevantní/neznámý","не се прилага/неизвестен","nevažeće/nepoznato"]
[{"$f":"IF(INDEX(B133:J133,Data!$K$4)=\"\",\"\",INDEX(B133:J133,Data!$K$4))","v":"Keuze"},"Choice","Keuze","Wybór","Výběr","Избор","Izbor"]
[{"$f":"IF(INDEX(B134:J134,Data!$K$4)=\"\",\"\",INDEX(B134:J134,Data!$K$4))","v":"Bedrijfstijd"},"Operating time","Bedrijfstijd","Czas działania","Provozní doba","Време на експлоатация","Ukupno vrijeme rada"]
[{"$f":"IF(INDEX(B135:J135,Data!$K$4)=\"\",\"\",INDEX(B135:J135,Data!$K$4))","v":"Gerapporteerde"},"Reported","Gerapporteerde","Raportowana","Reportované","Докладване","Izvještaj"]
[{"$f":"IF(INDEX(B136:J136,Data!$K$4)=\"\",\"\",INDEX(B136:J136,Data!$K$4))","v":"Gemiddelde belasting"},"Average load","Gemiddelde belasting","Średnie obciążenie","Průměrné zatížení","Средно натоварване","Prosječan utrošak goriva"]
[{"$f":"IF(INDEX(B137:J137,Data!$K$4)=\"\",\"\",INDEX(B137:J137,Data!$K$4))","v":"Emissie-eis"},"ELV","Emissie-eis","DWE","EL=emisní limit","Праг на допустими емесии","Max.koncentracija količine emisija"]
[{"$f":"IF(INDEX(B138:J138,Data!$K$4)=\"\",\"\",INDEX(B138:J138,Data!$K$4))","v":"Emissie-eis"},"Emission limit value","Emissie-eis","Dopuszczalna wartość emisji","Hodnota emisního limitu","Праг на допустими емисии","Max.koncentracija količine emisija"]
[{"$f":"IF(INDEX(B139:J139,Data!$K$4)=\"\",\"\",INDEX(B139:J139,Data!$K$4))","v":"concentratie"},"concentration","concentratie","stężenie","koncentrace","концентрация","koncentracija"]
[{"$f":"IF(INDEX(B140:J140,Data!$K$4)=\"\",\"\",INDEX(B140:J140,Data!$K$4))","v":"relatieve"},"relative","relatieve","względna","relativní","приблизително","relativno"]
[{"$f":"IF(INDEX(B141:J141,Data!$K$4)=\"\",\"\",INDEX(B141:J141,Data!$K$4))","v":" in % van de theoretische waarde"}," in % of theoretical value"," in % van de theoretische waarde"," w % wartości teoretycznej","v % teoretické hodnoty","в % от теоритичната стойност","u % teoretske vrijednosti"]
[{"$f":"IF(INDEX(B142:J142,Data!$K$4)=\"\",\"\",INDEX(B142:J142,Data!$K$4))","v":"Omschrijving"},"Description","Omschrijving","Opis","Popis","Описание","Opis"]
[{"$f":"IF(INDEX(B143:J143,Data!$K$4)=\"\",\"\",INDEX(B143:J143,Data!$K$4))","v":"Brandstofstikstof"},"Nitrogen originating from fuel","Brandstofstikstof","Azot pochodzący z paliwa","Dusík vzniklý z paliva","Азот, получен от горивото","Dušična osnova goriva"]
[{"$f":"IF(INDEX(B144:J144,Data!$K$4)=\"\",\"\",INDEX(B144:J144,Data!$K$4))","v":"Concentratie in mol%"},"Concentration in mol%","Concentratie in mol%","Stężenie w mol%","Koncentrace v mol%","Концентрация в mol%","Količinski udio u mol %"]
[{"$f":"IF(INDEX(B145:J145,Data!$K$4)=\"\",\"\",INDEX(B145:J145,Data!$K$4))","v":"Helium"},"Helium","Helium","Hel","Helium","Хелий","Helij"]
[{"$f":"IF(INDEX(B146:J146,Data!$K$4)=\"\",\"\",INDEX(B146:J146,Data!$K$4))","v":"Argon"},"Argon","Argon","Argon","Argon","Аргон","Argon"]
[{"$f":"IF(INDEX(B147:J147,Data!$K$4)=\"\",\"\",INDEX(B147:J147,Data!$K$4))","v":"Waterstofsulfide *"},"Hydrogensulphide *","Waterstofsulfide *","Siarkowodór *","Sirovodík","Хидрогенсулфид *","Sumporovodik *"]
[{"$f":"IF(INDEX(B148:J148,Data!$K$4)=\"\",\"\",INDEX(B148:J148,Data!$K$4))","v":"Waterstof"},"Hydrogen","Waterstof","Wodór","Vodík","Водород","Vodik"]
[{"$f":"IF(INDEX(B149:J149,Data!$K$4)=\"\",\"\",INDEX(B149:J149,Data!$K$4))","v":"Waterdamp"},"Water (vapour)","Waterdamp","Woda (para)","Voda (pára)","Вода (изпарение)","Voda (vodena para)"]
[{"$f":"IF(INDEX(B150:J150,Data!$K$4)=\"\",\"\",INDEX(B150:J150,Data!$K$4))","v":"Stikstof"},"Nitrogen","Stikstof","Azot  ","Dusík","Азот","Dušik"]
[{"$f":"IF(INDEX(B151:J151,Data!$K$4)=\"\",\"\",INDEX(B151:J151,Data!$K$4))","v":"Zuurstof"},"Oxygen","Zuurstof","Tlen","Kyslík","Кислород","Kisik"]
[{"$f":"IF(INDEX(B152:J152,Data!$K$4)=\"\",\"\",INDEX(B152:J152,Data!$K$4))","v":"Methaan"},"Methane","Methaan","Metan","Metan","Метан","Metan"]
[{"$f":"IF(INDEX(B153:J153,Data!$K$4)=\"\",\"\",INDEX(B153:J153,Data!$K$4))","v":"Koolstofmonoxide"},"Carbonmonoxide","Koolstofmonoxide","Tlenek węgla","Oxid uhelnatý","Въглероден моноксид","Ugljikov monoksid"]
[{"$f":"IF(INDEX(B154:J154,Data!$K$4)=\"\",\"\",INDEX(B154:J154,Data!$K$4))","v":"Koolstofdioxide"},"Carbondioxide","Koolstofdioxide","Dwutlenek węgla","Oxid uhličitý","Въглероден диоксид","Ugljikov dioksid"]
[{"$f":"IF(INDEX(B155:J155,Data!$K$4)=\"\",\"\",INDEX(B155:J155,Data!$K$4))","v":"Ethaan"},"Ethane","Ethaan","Etan","Etan","Етан","Etan"]
[{"$f":"IF(INDEX(B156:J156,Data!$K$4)=\"\",\"\",INDEX(B156:J156,Data!$K$4))","v":"Etheen *"},"Ethene *","Etheen *","Eten *","Eten *","Етен*","Eten *"]
[{"$f":"IF(INDEX(B157:J157,Data!$K$4)=\"\",\"\",INDEX(B157:J157,Data!$K$4))","v":"Ethyn *"},"Ethyne *","Ethyn *","Etyn *","Etyn *","Етин*","Etin *"]
[{"$f":"IF(INDEX(B158:J158,Data!$K$4)=\"\",\"\",INDEX(B158:J158,Data!$K$4))","v":"Propaan"},"Propane","Propaan","Propan","Propan","Пропан","Propan"]
[{"$f":"IF(INDEX(B159:J159,Data!$K$4)=\"\",\"\",INDEX(B159:J159,Data!$K$4))","v":"Propeen *"},"Propene *","Propeen *","Propen *","Propen *","Пропин*","Propen *"]
[{"$f":"IF(INDEX(B160:J160,Data!$K$4)=\"\",\"\",INDEX(B160:J160,Data!$K$4))","v":"2-Methylpropaan"},"2-Methylpropane","2-Methylpropaan","2-Metylopropan","2-Metylpropan","2-метилпропан","2-metilpropan"]
[{"$f":"IF(INDEX(B161:J161,Data!$K$4)=\"\",\"\",INDEX(B161:J161,Data!$K$4))","v":"n-Butaan"},"n-Butane","n-Butaan","n-Butan","n-Butan","n-бутан","n-butan"]
[{"$f":"IF(INDEX(B162:J162,Data!$K$4)=\"\",\"\",INDEX(B162:J162,Data!$K$4))","v":"Butadieen *"},"Butadiene *","Butadieen *","Butadien *","Butadien *","Бутадиен*","Butadien *"]
[{"$f":"IF(INDEX(B163:J163,Data!$K$4)=\"\",\"\",INDEX(B163:J163,Data!$K$4))","v":"2,2-Dimethylpropaan"},"2,2-Dimethylpropane","2,2-Dimethylpropaan","2,2-Dimetylopropan","2,2-Dimetylpropan","2,2-диметилпропан","2,2-dimetilpropan"]
[{"$f":"IF(INDEX(B164:J164,Data!$K$4)=\"\",\"\",INDEX(B164:J164,Data!$K$4))","v":"2-Methylbutaan"},"2-Methylbutane","2-Methylbutaan","2-Metylobutan","2-Metylbutan","2-Метилбутан","2-metilbutan"]
[{"$f":"IF(INDEX(B165:J165,Data!$K$4)=\"\",\"\",INDEX(B165:J165,Data!$K$4))","v":"n-Pentaan"},"n-Pentane","n-Pentaan","n-Pentan","n-Pentan","n-Пентан","n-pentan"]
[{"$f":"IF(INDEX(B166:J166,Data!$K$4)=\"\",\"\",INDEX(B166:J166,Data!$K$4))","v":"Cyclopentaan *"},"Cyclopentane *","Cyclopentaan *","Cyklopentan *","Cyklopentan *","Циклопентан*","Ciklopentan *"]
[{"$f":"IF(INDEX(B167:J167,Data!$K$4)=\"\",\"\",INDEX(B167:J167,Data!$K$4))","v":"2,2-Dimethylbutaan"},"2,2-Dimethylbutane","2,2-Dimethylbutaan","2,2-Dimetylobutan","2,2-Dimetylbutan","2,2-диметилбутан","2,2-dimetilbutan"]
[{"$f":"IF(INDEX(B168:J168,Data!$K$4)=\"\",\"\",INDEX(B168:J168,Data!$K$4))","v":"2,3-Dimethylbutaan"},"2,3-Dimethylbutane","2,3-Dimethylbutaan","2,3-Dimetylobutan","2,3-Dimetylbutan","2,3-диметилбутан","2,3-dimetilbutan"]
[{"$f":"IF(INDEX(B169:J169,Data!$K$4)=\"\",\"\",INDEX(B169:J169,Data!$K$4))","v":"3-Methylpentaan"},"3-Methylpentane","3-Methylpentaan","3-Metylopentan","3-Metylpentan","3-Метилпентан","3-metilpentan"]
[{"$f":"IF(INDEX(B170:J170,Data!$K$4)=\"\",\"\",INDEX(B170:J170,Data!$K$4))","v":"Cyclohexaan"},"Cyclohexane","Cyclohexaan","Cykloheksan","Cyklohexan","Цеклохексан","Cikloheksan"]
[{"$f":"IF(INDEX(B171:J171,Data!$K$4)=\"\",\"\",INDEX(B171:J171,Data!$K$4))","v":"n-Hexaan"},"n-Hexane","n-Hexaan","n-Heksan","n-Hexan","n-хексан","n-heksan"]
[{"$f":"IF(INDEX(B172:J172,Data!$K$4)=\"\",\"\",INDEX(B172:J172,Data!$K$4))","v":"Benzeen"},"Benzene","Benzeen","Benzen","Benzen","Бензен","Benzen"]
[{"$f":"IF(INDEX(B173:J173,Data!$K$4)=\"\",\"\",INDEX(B173:J173,Data!$K$4))","v":"2-Methylhexaan"},"2-Methylhexane","2-Methylhexaan","2-Metyloheksan","2-Metylhexan","2-метилхексан","2-metilheksan"]
[{"$f":"IF(INDEX(B174:J174,Data!$K$4)=\"\",\"\",INDEX(B174:J174,Data!$K$4))","v":"3-Methylhexaan"},"3-Methylhexane","3-Methylhexaan","3-Metyloheksan","3-Metylhexan","3-Метилпентан","3-metilheksan"]
[{"$f":"IF(INDEX(B175:J175,Data!$K$4)=\"\",\"\",INDEX(B175:J175,Data!$K$4))","v":"n-Heptaan"},"n-Heptane","n-Heptaan","n-Heptan","n-Heptan","n-хептан","n-heptan"]
[{"$f":"IF(INDEX(B176:J176,Data!$K$4)=\"\",\"\",INDEX(B176:J176,Data!$K$4))","v":"Methylcyclohexaan"},"Methylcyclohexane","Methylcyclohexaan","Metylocykloheksan","Metylcyklohexan","Метилциклохексан","Metilcikloheksan"]
[{"$f":"IF(INDEX(B177:J177,Data!$K$4)=\"\",\"\",INDEX(B177:J177,Data!$K$4))","v":"Tolueen"},"Toluene","Tolueen","Toluen","Toluen","Толуол","Toluen"]
[{"$f":"IF(INDEX(B178:J178,Data!$K$4)=\"\",\"\",INDEX(B178:J178,Data!$K$4))","v":"2-Methylheptaan *"},"2-Methylheptane *","2-Methylheptaan *","2-Metyloheptan *","2-Metylheptan *","2-Метилхептан * ","2-metilheptan *"]
[{"$f":"IF(INDEX(B179:J179,Data!$K$4)=\"\",\"\",INDEX(B179:J179,Data!$K$4))","v":"2,2,4-Trimethylpentaan"},"2,2,4-Trimethylpentane","2,2,4-Trimethylpentaan","2,2,4-Trimetylopentan","2,2,4-Trimetylpentan","2,2,4-Триметилпентан","2,2,4-trimetilpentan"]
[{"$f":"IF(INDEX(B180:J180,Data!$K$4)=\"\",\"\",INDEX(B180:J180,Data!$K$4))","v":"n-Octaan"},"n-Octane","n-Octaan","n-Oktan","n-Oktan","n-Октан","n-oktan"]
[{"$f":"IF(INDEX(B181:J181,Data!$K$4)=\"\",\"\",INDEX(B181:J181,Data!$K$4))","v":"Totaal"},"Total","Totaal","Razem","Celkem","Общо","Ukupno"]
[{"$f":"IF(INDEX(B182:J182,Data!$K$4)=\"\",\"\",INDEX(B182:J182,Data!$K$4))","v":"(*: verbinding niet genoemd in ISO 6976)"},"(*: compound not mentioned in ISO 6976)","(*: verbinding niet genoemd in ISO 6976)","(*: związek nie wymieniony w ISO 6976)","(*: sloučenina, která není uvedena v normě ISO 6976)","*: съединение, което не е отбелязано в ISO 6976","(*: tvar nije spomenuta u ISO 6976)"]
[{"$f":"IF(INDEX(B183:J183,Data!$K$4)=\"\",\"\",INDEX(B183:J183,Data!$K$4))","v":"Zwaveldioxide"},"Sulphurdioxide","Zwaveldioxide","Dwutlenek siarki","Oxid siřičitý","Серен диоксид","Sumporni dioksid"]
[{"$f":"IF(INDEX(B184:J184,Data!$K$4)=\"\",\"\",INDEX(B184:J184,Data!$K$4))","v":"mol C/mol"},"mol C/mol","mol C/mol","mol C/mol","mol C/mol","mol C/mol","mol C/mol goriva"]
[{"$f":"IF(INDEX(B185:J185,Data!$K$4)=\"\",\"\",INDEX(B185:J185,Data!$K$4))","v":"mol H/mol"},"mol H/mol","mol H/mol","mol H/mol","mol H/mol","mol H/mol","mol H/mol goriva"]
[{"$f":"IF(INDEX(B186:J186,Data!$K$4)=\"\",\"\",INDEX(B186:J186,Data!$K$4))","v":"mol O/mol"},"mol O/mol","mol O/mol","mol O/mol","mol O/mol","mol O/mol","mol O/mol goriva"]
[{"$f":"IF(INDEX(B187:J187,Data!$K$4)=\"\",\"\",INDEX(B187:J187,Data!$K$4))","v":"mol N/mol"},"mol N/mol","mol N/mol","mol N/mol","mol N/mol","mol N/mol","mol N/mol goriva"]
[{"$f":"IF(INDEX(B188:J188,Data!$K$4)=\"\",\"\",INDEX(B188:J188,Data!$K$4))","v":"mol S/mol"},"mol S/mol","mol S/mol","mol S/mol","mol S/mol","mol S/mol","mol S/mol goriva"]
[{"$f":"IF(INDEX(B189:J189,Data!$K$4)=\"\",\"\",INDEX(B189:J189,Data!$K$4))","v":"Molgewicht"},"Molecular weight","Molgewicht","Masa molekularna","Molekulární váha","Молекулно тегло","Molarna masa"]
[{"$f":"IF(INDEX(B190:J190,Data!$K$4)=\"\",\"\",INDEX(B190:J190,Data!$K$4))","v":"Compressibiliteit"},"Compressibility","Compressibiliteit","Ściśliwość","Stlačitelnost","Компресируемост","Stlačivost"]
[{"$f":"IF(INDEX(B191:J191,Data!$K$4)=\"\",\"\",INDEX(B191:J191,Data!$K$4))","v":"Molair volume op basis van compressibiliteit"},"Molar volume based on compressibility","Molair volume op basis van compressibiliteit","Objętość molowa oparta na ściśliwości","Molární množství založené na stlačitelnosti ","Молекулен обем на база на компресируемост","Molarni volumen temeljen na stlačivosti"]
[{"$f":"IF(INDEX(B192:J192,Data!$K$4)=\"\",\"\",INDEX(B192:J192,Data!$K$4))","v":",,  ,, op individuele molaire volumes"},",,  ,, on individual molar volumes",",,  ,, op individuele molaire volumes","- \" oparta na indywidualnej objętości molowej","\" \" na jednotlivá molární množství","\" \" при индивидуални молекулни обеми","„ „ po pojedinačnom molarnom volumenu"]
[{"$f":"IF(INDEX(B193:J193,Data!$K$4)=\"\",\"\",INDEX(B193:J193,Data!$K$4))","v":"Dichtheid"},"Density","Dichtheid","Gęstość","Hustota","Вискозитет","Gustoća"]
[{"$f":"IF(INDEX(B194:J194,Data!$K$4)=\"\",\"\",INDEX(B194:J194,Data!$K$4))","v":"Relatieve dichtheid"},"Relative density","Relatieve dichtheid","Gęstość względna","Relativní hustota","Относителен вискозитет","Relativna gustoća"]
[{"$f":"IF(INDEX(B195:J195,Data!$K$4)=\"\",\"\",INDEX(B195:J195,Data!$K$4))","v":"Stoichiometrisch verbranding"},"Stoichiometric combustion","Stoichiometrisch verbranding","Spalanie stechiometryczne","Stechiometrické spalování","Стохиометрично изгаряне","Stehiometrijsko izgaranje"]
[{"$f":"IF(INDEX(B196:J196,Data!$K$4)=\"\",\"\",INDEX(B196:J196,Data!$K$4))","v":"Zuurstofverbruik (mol/mol)"},"Oxygen demand (mol/mol)","Zuurstofverbruik (mol/mol)","Zapotrzebowanie na tlen (mol/mol)","Spotřeba kyslíku (mol/mol)","Нужда от кислород (mol/mol)","Potrebno kisika (mol/mol)"]
[{"$f":"IF(INDEX(B197:J197,Data!$K$4)=\"\",\"\",INDEX(B197:J197,Data!$K$4))","v":"Zuurstofverbruik"},"Oxygen demand","Zuurstofverbruik","Zapotrzebowanie na tlen","Spotřeba kyslíku","Нужда от кислород","Potrebno kisika"]
[{"$f":"IF(INDEX(B198:J198,Data!$K$4)=\"\",\"\",INDEX(B198:J198,Data!$K$4))","v":"DIN1942"},"DIN1942","DIN1942","DIN1942","norma DIN1942","DIN1942","DIN1942"]
[{"$f":"IF(INDEX(B199:J199,Data!$K$4)=\"\",\"\",INDEX(B199:J199,Data!$K$4))","v":"samenstelling"},"composition","samenstelling","skład","složení","състав","struktura "]
[{"$f":"IF(INDEX(B200:J200,Data!$K$4)=\"\",\"\",INDEX(B200:J200,Data!$K$4))","v":"mol C/kg"},"mol C/kg","mol C/kg","mol C/kg","mol C/kg","mol C/kg","mol C/kg"]
[{"$f":"IF(INDEX(B201:J201,Data!$K$4)=\"\",\"\",INDEX(B201:J201,Data!$K$4))","v":"mol H/kg"},"mol H/kg","mol H/kg","mol H/kg","mol H/kg","mol H/kg","mol H/kg"]
[{"$f":"IF(INDEX(B202:J202,Data!$K$4)=\"\",\"\",INDEX(B202:J202,Data!$K$4))","v":"mol N/kg"},"mol N/kg","mol N/kg","mol N/kg","mol N/kg","mol N/kg","mol N/kg"]
[{"$f":"IF(INDEX(B203:J203,Data!$K$4)=\"\",\"\",INDEX(B203:J203,Data!$K$4))","v":"mol S/kg"},"mol S/kg","mol S/kg","mol S/kg","mol S/kg","mol S/kg","mol S/kg"]
[{"$f":"IF(INDEX(B204:J204,Data!$K$4)=\"\",\"\",INDEX(B204:J204,Data!$K$4))","v":"mol O/kg"},"mol O/kg","mol O/kg","mol O/kg","mol O/kg","mol O/kg","mol O/kg"]
[{"$f":"IF(INDEX(B205:J205,Data!$K$4)=\"\",\"\",INDEX(B205:J205,Data!$K$4))","v":"C (gew%)"},"C (weight%)","C (gew%)","C (wagowy%)","C (váha%)","C (тегло %)","C (maseni udio %)"]
[{"$f":"IF(INDEX(B206:J206,Data!$K$4)=\"\",\"\",INDEX(B206:J206,Data!$K$4))","v":"H (gew%)"},"H (weight%)","H (gew%)","H (wagowy%)","H (váha %)","H (тегло%)","H (maseni udio %)"]
[{"$f":"IF(INDEX(B207:J207,Data!$K$4)=\"\",\"\",INDEX(B207:J207,Data!$K$4))","v":"N (gew%)"},"N (weight%)","N (gew%)","N (wagowy%)","N (váha %)","N (тегло%)","N (maseni udio %)"]
[{"$f":"IF(INDEX(B208:J208,Data!$K$4)=\"\",\"\",INDEX(B208:J208,Data!$K$4))","v":"S (gew%)"},"S (weight%)","S (gew%)","S (wagowy%)","S (váha%)","S (тегло%)","S (maseni udio %)"]
[{"$f":"IF(INDEX(B209:J209,Data!$K$4)=\"\",\"\",INDEX(B209:J209,Data!$K$4))","v":"As (gew%)"},"Ash (weight%)","As (gew%)","Popiół (wagowy%)","Popílek (váha% )","Ash (тегло%)","Ash (maseni udio %)"]
[{"$f":"IF(INDEX(B210:J210,Data!$K$4)=\"\",\"\",INDEX(B210:J210,Data!$K$4))","v":"O (gew%)"},"O (weight%)","O (gew%)","O (wagowy%)","O (váha %)","O (тегло%)","O (maseni udio %)"]
[{"$f":"IF(INDEX(B211:J211,Data!$K$4)=\"\",\"\",INDEX(B211:J211,Data!$K$4))","v":"C (gew%,droog)"},"C (weight%,dry)","C (gew%,droog)","C (wagowy% masy suchej)","C (váha %, suchý)","C (тегло%,сух)","C (maseni udio %, suhi)"]
[{"$f":"IF(INDEX(B212:J212,Data!$K$4)=\"\",\"\",INDEX(B212:J212,Data!$K$4))","v":"H (gew%,droog)"},"H (weight%,dry)","H (gew%,droog)","H (wagowy% masy suchej)","H (váha%, suchý)","H (тегло%,сух)","H (maseni udio %, suhi)"]
[{"$f":"IF(INDEX(B213:J213,Data!$K$4)=\"\",\"\",INDEX(B213:J213,Data!$K$4))","v":"N (gew%,droog)"},"N (weight%,dry)","N (gew%,droog)","N (wagowy% masy suchej)","N (váha %, suchý)","N (тегло%,сух)","N (maseni udio %, suhi)"]
[{"$f":"IF(INDEX(B214:J214,Data!$K$4)=\"\",\"\",INDEX(B214:J214,Data!$K$4))","v":"S (gew%,droog)"},"S (weight%,dry)","S (gew%,droog)","S (wagowy% masy suchej)","S (váha %, suchý)","S (тегло%,сух)","S (maseni udio %, suhi)"]
[{"$f":"IF(INDEX(B215:J215,Data!$K$4)=\"\",\"\",INDEX(B215:J215,Data!$K$4))","v":"O (gew% droog)"},"O (weight% dry)","O (gew% droog)","O (wagowy% masy suchej)","O (váha %, suchý)","O (тегло%,сух)","O (maseni udio %, suhi)"]
[{"$f":"IF(INDEX(B216:J216,Data!$K$4)=\"\",\"\",INDEX(B216:J216,Data!$K$4))","v":"As (gew% droog)"},"Ash (weight% dry)","As (gew% droog)","Popiół (wagowy% masy suchej)","Popílek (váha% , suchý)","Пепел (тегло%, сух)","Ash (maseni udio %, suhi)"]
[{"$f":"IF(INDEX(B217:J217,Data!$K$4)=\"\",\"\",INDEX(B217:J217,Data!$K$4))","v":"Rookgasdebiet"},"Flue gas flow","Rookgasdebiet","Przepływ spalin","Průtok kouřového plynu","Дебит на димни газове","Protok dimnih plinova"]
[{"$f":"IF(INDEX(B218:J218,Data!$K$4)=\"\",\"\",INDEX(B218:J218,Data!$K$4))","v":"Vochtgehalte"},"Moisture","Vochtgehalte","Wilgotność","Vlhkost","Влажност","Vlažnost"]
[{"$f":"IF(INDEX(B219:J219,Data!$K$4)=\"\",B219,INDEX(B219:J219,Data!$K$4))","v":"Temperatuur"},"Temperature","Temperatuur"]
[{"$f":"IF(INDEX(B220:J220,Data!$K$4)=\"\",B220,INDEX(B220:J220,Data!$K$4))","v":"m3/s"},"m3/s","m3/s"]
[{"$f":"IF(INDEX(B221:J221,Data!$K$4)=\"\",B221,INDEX(B221:J221,Data!$K$4))","v":"Dwarsdoorsnede afgaskanaal"},"Cross section duct","Dwarsdoorsnede afgaskanaal"]
[{"$f":"IF(INDEX(B222:J222,Data!$K$4)=\"\",B222,INDEX(B222:J222,Data!$K$4))","v":"m2"},"m2","m2"]
[{"$f":"IF(INDEX(B223:J223,Data!$K$4)=\"\",B223,INDEX(B223:J223,Data!$K$4))","v":"berekend"},"calculated","berekend"]
[{"$f":"IF(INDEX(B224:J224,Data!$K$4)=\"\",B224,INDEX(B224:J224,Data!$K$4))","v":"Dauwpunt"},"Dewpoint","Dauwpunt"]
[{"$f":"IF(INDEX(B225:J225,Data!$K$4)=\"\",B225,INDEX(B225:J225,Data!$K$4))","v":"Berekening van emissies"},"Calculation of emissions","Berekening van emissies"]
[{"$f":"IF(INDEX(B226:J226,Data!$K$4)=\"\",B226,INDEX(B226:J226,Data!$K$4))","v":"Wis invoer"},"Clear data","Wis invoer"]
[{"$f":"IF(INDEX(B227:J227,Data!$K$4)=\"\",B227,INDEX(B227:J227,Data!$K$4))","v":"Afgassnelheid"},"Flue gas velocity","Afgassnelheid"]
[{"$f":"IF(INDEX(B228:J228,Data!$K$4)=\"\",B228,INDEX(B228:J228,Data!$K$4))","v":"m/s"},"m/s","m/s"]
[{"$f":"IF(INDEX(B229:J229,Data!$K$4)=\"\",B229,INDEX(B229:J229,Data!$K$4))","v":0}]
[{"$f":"IF(INDEX(B230:J230,Data!$K$4)=\"\",B230,INDEX(B230:J230,Data!$K$4))","v":0}]
[{"$f":"IF(INDEX(B231:J231,Data!$K$4)=\"\",B231,INDEX(B231:J231,Data!$K$4))","v":0}]
[{"$f":"IF(INDEX(B232:J232,Data!$K$4)=\"\",B232,INDEX(B232:J232,Data!$K$4))","v":0}]
[{"$f":"IF(INDEX(B233:J233,Data!$K$4)=\"\",B233,INDEX(B233:J233,Data!$K$4))","v":0}]
[{"$f":"IF(INDEX(B234:J234,Data!$K$4)=\"\",B234,INDEX(B234:J234,Data!$K$4))","v":0}]
[{"$f":"IF(INDEX(B235:J235,Data!$K$4)=\"\",B235,INDEX(B235:J235,Data!$K$4))","v":0}]
[{"$f":"IF(INDEX(B236:J236,Data!$K$4)=\"\",B236,INDEX(B236:J236,Data!$K$4))","v":0}]
[{"$f":"IF(INDEX(B237:J237,Data!$K$4)=\"\",B237,INDEX(B237:J237,Data!$K$4))","v":0}]
[{"$f":"IF(INDEX(B238:J238,Data!$K$4)=\"\",B238,INDEX(B238:J238,Data!$K$4))","v":0}]
[{"$f":"IF(INDEX(B239:J239,Data!$K$4)=\"\",B239,INDEX(B239:J239,Data!$K$4))","v":0}]
[{"$f":"IF(INDEX(B240:J240,Data!$K$4)=\"\",B240,INDEX(B240:J240,Data!$K$4))","v":0}]
[{"$f":"IF(INDEX(B241:J241,Data!$K$4)=\"\",B241,INDEX(B241:J241,Data!$K$4))","v":0}]
[{"$f":"IF(INDEX(B242:J242,Data!$K$4)=\"\",B242,INDEX(B242:J242,Data!$K$4))","v":0}]
[{"$f":"IF(INDEX(B243:J243,Data!$K$4)=\"\",B243,INDEX(B243:J243,Data!$K$4))","v":0}]
[{"$f":"IF(INDEX(B244:J244,Data!$K$4)=\"\",B244,INDEX(B244:J244,Data!$K$4))","v":0}]
[{"$f":"IF(INDEX(B245:J245,Data!$K$4)=\"\",B245,INDEX(B245:J245,Data!$K$4))","v":0}]
[{"$f":"IF(INDEX(B246:J246,Data!$K$4)=\"\",B246,INDEX(B246:J246,Data!$K$4))","v":0}]
[{"$f":"IF(INDEX(B247:J247,Data!$K$4)=\"\",B247,INDEX(B247:J247,Data!$K$4))","v":0}]
[{"$f":"IF(INDEX(B248:J248,Data!$K$4)=\"\",B248,INDEX(B248:J248,Data!$K$4))","v":0}]
[{"$f":"IF(INDEX(B249:J249,Data!$K$4)=\"\",B249,INDEX(B249:J249,Data!$K$4))","v":0}]
[{"$f":"IF(INDEX(B250:J250,Data!$K$4)=\"\",B250,INDEX(B250:J250,Data!$K$4))","v":0}]
[{"$f":"IF(INDEX(B251:J251,Data!$K$4)=\"\",B251,INDEX(B251:J251,Data!$K$4))","v":0}]
[{"$f":"IF(INDEX(B252:J252,Data!$K$4)=\"\",B252,INDEX(B252:J252,Data!$K$4))","v":0}]

{"sheet":"Handleiding validatie","index":1,"n_rows":0,"n_cols":0,"rows_kept":0,"cut":false,"hidden":true,"merged":[]}

{"sheet":"Emission data","index":2,"n_rows":37,"n_cols":14,"rows_kept":37,"cut":false,"hidden":false,"merged":[[30,12,30,13],[33,12,33,13],[28,12,28,13],[10,8,10,9],[10,12,10,13],[10,10,10,11],[28,9,28,11],[29,12,29,13],[29,6,29,8],[1,4,1,7],[8,12,8,13],[1,8,1,13],[8,4,8,5],[8,6,8,7],[8,8,8,9],[2,8,2,9],[2,12,7,13],[8,10,8,11],[29,4,29,5],[10,4,10,5],[10,6,10,7],[28,4,28,5],[28,6,28,8]]}
[{"$f":"IF(OR(NOW()>Data!B2,I2=\"\"),0,1)","v":1}]
[null,{"$f":"language!A20","v":"Installatie/eenheid"},null,null,null,null,null,null,{"$f":"language!A2","v":"Validatietest voor emissies naar lucht"}]
[null,{"$f":"language!A21","v":"Type"},null,null,1,null,null,null,{"$f":"language!A10","v":"Taal"},null,null,null,{"$f":"IF(NOW()<=Data!B2,CONCATENATE(language!A4,\" \",Data!B1,\" : \",IF(language!A5=\"\",\"\",CONCATENATE(language!A5,\" \",DAY(Data!B2),\"-\",MONTH(Data!B2),\"-\",YEAR(Data!B2),\".\",CHAR(10))),language!A3),IF(language!A6=\"\",\"\",language!A6))","v":"Versie 2024 : Deze versie is te gebruiken tot  1-4-2026.\nOndanks de zorgvuldigheid waarmee dit werkblad is opgesteld, zijn fouten niet uit te sluiten."}]
[null,{"$f":"language!A26","v":"Bedrijfsvoering"},null,null,1,{"$f":"IF(A1=1,IF(ISNUMBER(H4),H4,INDEX(Data!C5:C9,'Emission data'!E4)),\"\")","v":8760},null,null,{"$f":"language!A98","v":"Menu"},{"$f":"language!A61","v":"Validatietest"}]
[null,{"$f":"language!A22","v":"Thermisch vermogen"},null,null,{"$f":"IF(A1=1,IF(H5<>\"\",H5,IF(G5=899,0,(1+(G5-TRUNC(G5/900)*900)/100)*10^(TRUNC(G5/900)-2))),\"\")","v":50},{"$f":"language!A65","v":"MW"},3100,null,null,{"$f":"language!A62","v":"Wijzig gegevens gasvormige brandstoffen"}]
[null,{"$f":"language!A23","v":"Elektrisch rendement"},null,null,{"$f":"IF(A1=1,IF(H6<>\"\",H6,IF(OR(E3=1,E3=3,E3=8),0,G6)),\"\")","v":0},{"$f":"IF(A1=0,\"\",\"%\")","v":"%"},40,null,null,{"$f":"language!A63","v":"Wijzig gegevens vloeibare brandstoffen"}]
[null,{"$f":"language!A24","v":"Elektrische belasting"},null,null,{"$f":"IF(A1=1,E6/100*E5,\"\")","v":0},{"$f":"language!A65","v":"MW"},null,null,null,{"$f":"language!A64","v":"Wijzig gegevens vaste brandstoffen"}]
[null,{"$f":"IF(E8=\"\",\"\",language!A25)","v":"Max. stoomproductie"},null,null,{"$f":"IF(A1=1,IF(OR(E3=2,E3=4,E3=6),\"\",(E5-E7)*3600/2.3/1000),\"\")","v":78.260869565217391},{"$f":"IF(E8=\"\",\"\",language!A66)","v":"ton/uur"},null,null,null,{"$f":"language!A226","v":"Wis invoer"}]
[null,{"$f":"language!A27","v":"Brandstof"},null,null,1,null,{"$f":"IF(E9=\"\",\"\",IF(G10=1,\"\",E9+1))","v":""},null,{"$f":"IF(G9=\"\",\"\",IF(I10=1,\"\",G9+1))","v":""},null,{"$f":"IF(I9=\"\",\"\",IF(K10=1,\"\",I9+1))","v":""},null,{"$f":"language!A68","v":"Totaal"}]
[null,{"$f":"B3","v":"Type"},null,null,{"$f":"IF(A1=1,F10,1)","v":1},1,{"$f":"IF(A1=1,H10,1)","v":1},1,{"$f":"IF(A1=1,J10,1)","v":1},1,{"$f":"IF(A1=1,L10,1)","v":1},1]
[null,{"$f":"language!A33","v":"Berekeningsmethode"},null,null,{"$f":"IF(E10=1,\"\",INDEX(Data!$E$16:$E$31,'Emission data'!E10))","v":""},null,{"$f":"IF(G10=1,\"\",INDEX(Data!$E$16:$E$31,'Emission data'!G10))","v":""},null,{"$f":"IF(I10=1,\"\",INDEX(Data!$E$16:$E$31,'Emission data'!I10))","v":""},null,{"$f":"IF(K10=1,\"\",INDEX(Data!$E$16:$E$31,'Emission data'!K10))","v":""}]
[null,{"$f":"language!A34","v":"Onderste verbrandingswaarde"},null,null,{"$f":"IF(E$10=1,\"\",INDEX(Data!$D$16:$D$31,'Emission data'!E$10))","v":""},{"$f":"IF(E$10=1,\"\",IF(E$10<7,language!$A$70,language!$A$72))","v":""},{"$f":"IF(G$10=1,\"\",INDEX(Data!$D$16:$D$31,'Emission data'!G$10))","v":""},{"$f":"IF(G$10=1,\"\",IF(G$10<7,language!$A$70,language!$A$72))","v":""},{"$f":"IF(I$10=1,\"\",INDEX(Data!$D$16:$D$31,'Emission data'!I$10))","v":""},{"$f":"IF(I$10=1,\"\",IF(I$10<7,language!$A$70,language!$A$72))","v":""},{"$f":"IF(K$10=1,\"\",INDEX(Data!$D$16:$D$31,'Emission data'!K$10))","v":""},{"$f":"IF(K$10=1,\"\",IF(K$10<7,language!$A$70,language!$A$72))","v":""}]
[null,{"$f":"CONCATENATE(language!A38,\"-\",LOWER(language!A56))","v":"SO2-emissie"},null,null,{"$f":"IF(E$10=1,\"\",INDEX(Data!$L$16:$L$31,'Emission data'!E$10))","v":""},{"$f":"IF(E$10=1,\"\",language!$A$76)","v":""},{"$f":"IF(G$10=1,\"\",INDEX(Data!$L$16:$L$31,'Emission data'!G$10))","v":""},{"$f":"IF(G$10=1,\"\",language!$A$76)","v":""},{"$f":"IF(I$10=1,\"\",INDEX(Data!$L$16:$L$31,'Emission data'!I$10))","v":""},{"$f":"IF(I$10=1,\"\",language!$A$76)","v":""},{"$f":"IF(K$10=1,\"\",INDEX(Data!$L$16:$L$31,'Emission data'!K$10))","v":""},{"$f":"IF(K$10=1,\"\",language!$A$76)","v":""}]
[null,{"$f":"CONCATENATE(language!A39,\"-\",LOWER(language!A56))","v":"CO2-emissie"},null,null,{"$f":"IF(E$10=1,\"\",INDEX(Data!$F$16:$F$31,'Emission data'!E$10))","v":""},{"$f":"IF(E$10=1,\"\",language!$A$76)","v":""},{"$f":"IF(G$10=1,\"\",INDEX(Data!$F$16:$F$31,'Emission data'!G$10))","v":""},{"$f":"IF(G$10=1,\"\",language!$A$76)","v":""},{"$f":"IF(I$10=1,\"\",INDEX(Data!$F$16:$F$31,'Emission data'!I$10))","v":""},{"$f":"IF(I$10=1,\"\",language!$A$76)","v":""},{"$f":"IF(K$10=1,\"\",INDEX(Data!$F$16:$F$31,'Emission data'!K$10))","v":""},{"$f":"IF(K$10=1,\"\",language!$A$76)","v":""}]
[null,{"$f":"language!A44","v":"Stoichiometrisch rookgasvolume (droog)"},null,null,{"$f":"IF(E$10=1,\"\",INDEX(Data!$G$16:$G$31,'Emission data'!E$10))","v":""},{"$f":"IF(E$10=1,\"\",IF(E$10<7,language!$A$80,language!$A$81))","v":""},{"$f":"IF(G$10=1,\"\",INDEX(Data!$G$16:$G$31,'Emission data'!G$10))","v":""},{"$f":"IF(G$10=1,\"\",IF(G$10<7,language!$A$80,language!$A$81))","v":""},{"$f":"IF(I$10=1,\"\",INDEX(Data!$G$16:$G$31,'Emission data'!I$10))","v":""},{"$f":"IF(I$10=1,\"\",IF(I$10<7,language!$A$80,language!$A$81))","v":""},{"$f":"IF(K$10=1,\"\",INDEX(Data!$G$16:$G$31,'Emission data'!K$10))","v":""},{"$f":"IF(K$10=1,\"\",IF(K$10<7,language!$A$80,language!$A$81))","v":""},{"$f":"IF(OR($A$1=0,$G$29=\"\"),\"\",(IF(E$22=\"\",0,E$19*E15)+IF(G20=\"\",0,G$19*G15)+IF(I20=\"\",0,I$19*I15)+IF(K20=\"\",0,K$19*K15)))","v":0},{"$f":"IF(G29=\"\",\"\",language!A82)","v":"Nm3/jaar"}]
[null,{"$f":"CONCATENATE(language!A45,\" (\",language!A47,\")\")","v":"Stoichiometrisch rookgasvolume (nat)"},null,null,{"$f":"IF(E$10=1,\"\",INDEX(Data!$M$16:$M$31,'Emission data'!E$10))","v":""},{"$f":"IF(E$10=1,\"\",IF(E$10<7,language!$A$80,language!$A$81))","v":""},{"$f":"IF(G$10=1,\"\",INDEX(Data!$M$16:$M$31,'Emission data'!G$10))","v":""},{"$f":"IF(G$10=1,\"\",IF(G$10<7,language!$A$80,language!$A$81))","v":""},{"$f":"IF(I$10=1,\"\",INDEX(Data!$M$16:$M$31,'Emission data'!I$10))","v":""},{"$f":"IF(I$10=1,\"\",IF(I$10<7,language!$A$80,language!$A$81))","v":""},{"$f":"IF(K$10=1,\"\",INDEX(Data!$M$16:$M$31,'Emission data'!K$10))","v":""},{"$f":"IF(K$10=1,\"\",IF(K$10<7,language!$A$80,language!$A$81))","v":""},{"$f":"IF(OR($A$1=0,$G$29=\"\"),\"\",(IF(E$22=\"\",0,E$19*E16)+IF(G22=\"\",0,G$19*G16)+IF(I22=\"\",0,I$19*I16)+IF(K22=\"\",0,K$19*K16)))","v":0},{"$f":"IF(G29=\"\",\"\",language!A82)","v":"Nm3/jaar"}]
[null,{"$f":"language!A48","v":"Toepassing"},null,null,1,null,1,null,1,null,1]
[null,{"$f":"language!A49","v":"Verbruik"},null,null,999,null,900,null,900,null,900]
[null,null,null,null,{"$f":"IF(E10=1,\"\",IF(F18=\"\",E18/1000*E5/E12*3600*IF(ISNUMBER(H4),H4,IF(E4=5,500,INDEX(Data!C5:C9,'Emission data'!E4))),F18)*IF(E17=2,-1,1))","v":""},{"$f":"IF(E$10=1,\"\",IF(E$10<7,language!$A$82,language!$A$83))","v":""},{"$f":"IF(G10=1,\"\",IF(H18=\"\",(1+(G18-TRUNC(G18/900)*900)/100)*10^(TRUNC(G18/900)+1),H18)*IF(G17=2,-1,1))","v":""},{"$f":"IF(G$10=1,\"\",IF(G$10<7,language!$A$82,language!$A$83))","v":""},{"$f":"IF(I10=1,\"\",IF(J18=\"\",(1+(I18-TRUNC(I18/900)*900)/100)*10^(TRUNC(I18/900)+1),J18)*IF(I17=2,-1,1))","v":""},{"$f":"IF(I$10=1,\"\",IF(I$10<7,language!$A$82,language!$A$83))","v":""},{"$f":"IF(K10=1,\"\",IF(L18=\"\",(1+(K18-TRUNC(K18/900)*900)/100)*10^(TRUNC(K18/900)+1),L18)*IF(K17=2,-1,1))","v":""},{"$f":"IF(K$10=1,\"\",IF(K$10<7,language!$A$82,language!$A$83))","v":""}]
[null,null,null,null,{"$f":"IF(OR(E10=1,$F$4=0,$F$4=\"\"),\"\",IF(F18<>\"\",F18/$F$4,E19/$F$4))","v":""},{"$f":"IF(OR(E$10=1,E20=\"\"),\"\",IF(E$10<7,language!$A$84,language!$A$85))","v":""},{"$f":"IF(OR(G10=1,$F$4=0,$F$4=\"\"),\"\",IF(H18<>\"\",H18/$F$4,G19/$F$4))","v":""},{"$f":"IF(OR(G$10=1,G20=\"\"),\"\",IF(G$10<7,language!$A$84,language!$A$85))","v":""},{"$f":"IF(OR(I10=1,$F$4=0,$F$4=\"\"),\"\",IF(J18<>\"\",J18/$F$4,I19/$F$4))","v":""},{"$f":"IF(OR(I$10=1,I20=\"\"),\"\",IF(I$10<7,language!$A$84,language!$A$85))","v":""},{"$f":"IF(OR(K10=1,$F$4=0,$F$4=\"\"),\"\",IF(L18<>\"\",L18/$F$4,K19/$F$4))","v":""},{"$f":"IF(OR(K$10=1,K20=\"\"),\"\",IF(K$10<7,language!$A$84,language!$A$85))","v":""}]
[null,{"$f":"IF(Data!N4=TRUE(),B28,B26)","v":"CO2-emissie"},null,null,{"$f":"IF(Data!Q4=TRUE(),E28,E26)","v":""},{"$f":"IF(Data!R4=TRUE(),F28,F26)","v":""},{"$f":"IF(Data!S4=TRUE(),G28,G26)","v":""},{"$f":"IF(Data!T4=TRUE(),H28,H26)","v":""},{"$f":"IF(Data!U4=TRUE(),I28,I26)","v":""},{"$f":"IF(Data!V4=TRUE(),J28,J26)","v":""},{"$f":"IF(Data!W4=TRUE(),K28,K26)","v":""},{"$f":"IF(Data!X4=TRUE(),L28,L26)","v":""},{"$f":"IF(Data!Y4=TRUE(),M28,M26)","v":0},{"$f":"IF(Data!Z4=TRUE(),N28,N26)","v":"kton/jaar"}]
[null,{"$f":"language!A50","v":"Energieverbruik"},null,null,{"$f":"IF(E19=\"\",\"\",E19*E12/1000000)","v":""},{"$f":"IF(E19=\"\",\"\",language!$A$87)","v":""},{"$f":"IF(G19=\"\",\"\",G19*G12/1000000)","v":""},{"$f":"IF(G19=\"\",\"\",language!$A$87)","v":""},{"$f":"IF(I19=\"\",\"\",I19*I12/1000000)","v":""},{"$f":"IF(I19=\"\",\"\",language!$A$87)","v":""},{"$f":"IF(K19=\"\",\"\",K19*K12/1000000)","v":""},{"$f":"IF(K19=\"\",\"\",language!$A$87)","v":""},{"$f":"IF(A1=1,(IF('Emission data'!E22=\"\",0,'Emission data'!E22)+IF('Emission data'!G22=\"\",0,'Emission data'!G22)+IF('Emission data'!I22=\"\",0,'Emission data'!I22)+IF('Emission data'!K22=\"\",0,'Emission data'!K22)),\"\")","v":0},{"$f":"language!A87","v":"TJ/jaar"}]
[null,{"$f":"language!A51","v":"Gemiddelde belasting"},null,null,null,null,null,null,null,null,null,null,{"$f":"IF(OR(A1=0,E5=0,F4=0,F4=\"\"),\"\",ROUND((M22*1000000/3600/F4/E5*100),0))","v":0},{"$f":"IF(M23=\"\",\"\",\"%\")","v":"%"}]
[null,{"$f":"B13","v":"SO2-emissie"},null,null,{"$f":"IF(E19=\"\",\"\",E22*E13)","v":""},{"$f":"IF(E19=\"\",\"\",language!$A$89)","v":""},{"$f":"IF(G19=\"\",\"\",G22*G13)","v":""},{"$f":"IF(G19=\"\",\"\",language!$A$89)","v":""},{"$f":"IF(I19=\"\",\"\",I22*I13)","v":""},{"$f":"IF(I19=\"\",\"\",language!$A$89)","v":""},{"$f":"IF(K19=\"\",\"\",K22*K13)","v":""},{"$f":"IF(K19=\"\",\"\",language!$A$89)","v":""},{"$f":"IF(A1=1,(IF(E24=\"\",0,E24)+IF(G24=\"\",0,G24)+IF(I24=\"\",0,I24)+IF(K24=\"\",0,K24)),\"\")","v":0},{"$f":"IF(M24=\"\",\"\",language!A89)","v":"ton/jaar"}]
[null,null,null,null,{"$f":"IF(E20=\"\",\"\",E20*E12*E13/1000)","v":""},{"$f":"IF(E25=\"\",\"\",language!$A$85)","v":""},{"$f":"IF(G20=\"\",\"\",G20*G12*G13/1000)","v":""},{"$f":"IF(G25=\"\",\"\",language!$A$85)","v":""},{"$f":"IF(I20=\"\",\"\",I20*I12*I13/1000)","v":""},{"$f":"IF(I25=\"\",\"\",language!$A$85)","v":""},{"$f":"IF(K20=\"\",\"\",K20*K12*K13/1000)","v":""},{"$f":"IF(K25=\"\",\"\",language!$A$85)","v":""},{"$f":"IF(OR(A1=0,$F$4=0,$F$4=\"\"),\"\",(IF(E25=\"\",0,E25)+IF(G25=\"\",0,G25)+IF(I25=\"\",0,I25)+IF(K25=\"\",0,K25)))","v":0},{"$f":"IF(M25=\"\",\"\",language!A85)","v":"kg/uur"}]
[null,{"$f":"B14","v":"CO2-emissie"},null,null,{"$f":"IF(E19=\"\",\"\",E19*E12*E14/1000/1000)","v":""},{"$f":"IF(E19=\"\",\"\",language!$A$89)","v":""},{"$f":"IF(G19=\"\",\"\",G19*G12*G14/1000/1000)","v":""},{"$f":"IF(G19=\"\",\"\",language!$A$89)","v":""},{"$f":"IF(I19=\"\",\"\",I19*I12*I14/1000/1000)","v":""},{"$f":"IF(I19=\"\",\"\",language!$A$89)","v":""},{"$f":"IF(K19=\"\",\"\",K19*K12*K14/1000/1000)","v":""},{"$f":"IF(K19=\"\",\"\",language!$A$89)","v":""},{"$f":"IF(A1=1,(IF(E26=\"\",0,E26)+IF(G26=\"\",0,G26)+IF(I26=\"\",0,I26)+IF(K26=\"\",0,K26))/1000,\"\")","v":0},{"$f":"language!A90","v":"kton/jaar"}]
[null,{"$f":"language!A52","v":"Gehalte fossiele brandstof"},null,null,{"$f":"IF(E$10=1,\"\",INDEX(Data!$C$16:$C$31,'Emission data'!E$10))","v":""},{"$f":"IF(E19=\"\",\"\",\"%\")","v":""},{"$f":"IF(G$10=1,\"\",INDEX(Data!$C$16:$C$31,'Emission data'!G$10))","v":""},{"$f":"IF(G19=\"\",\"\",\"%\")","v":""},{"$f":"IF(I$10=1,\"\",INDEX(Data!$C$16:$C$31,'Emission data'!I$10))","v":""},{"$f":"IF(I19=\"\",\"\",\"%\")","v":""},{"$f":"IF(K$10=1,\"\",INDEX(Data!$C$16:$C$31,'Emission data'!K$10))","v":""},{"$f":"IF(K19=\"\",\"\",\"%\")","v":""}]
[null,{"$f":"CONCATENATE(B14,\" \",language!A53)","v":"CO2-emissie voor handel"},null,null,{"$f":"IF(E19=\"\",\"\",E26*E27/100)","v":""},{"$f":"IF(E19=\"\",\"\",language!$A$89)","v":""},{"$f":"IF(G19=\"\",\"\",G26*G27/100)","v":""},{"$f":"IF(G19=\"\",\"\",language!$A$89)","v":""},{"$f":"IF(I19=\"\",\"\",I26*I27/100)","v":""},{"$f":"IF(I19=\"\",\"\",language!$A$89)","v":""},{"$f":"IF(K19=\"\",\"\",K26*K27/100)","v":""},{"$f":"IF(K19=\"\",\"\",language!$A$89)","v":""},{"$f":"IF(A1=1,(IF(E28=\"\",0,E28)+IF(G28=\"\",0,G28)+IF(I28=\"\",0,I28)+IF(K28=\"\",0,K28))/1000,\"\")","v":0},{"$f":"N26","v":"kton/jaar"}]
[null,{"$f":"language!A54","v":"Rookgas"},null,null,{"$f":"IF(A1=0,\"\",language!$A$60)","v":"Invoer emissiegegevens"},null,{"$f":"language!A55","v":"Concentratie in droog rookgas"},null,null,{"$f":"language!A56","v":"Emissie"},null,null,{"$f":"language!A217","v":"Rookgasdebiet"}]
[null,null,null,null,null,null,{"$f":"IF(language!A9=\"\",\"\",CONCATENATE(\"(\",language!A9,\")\"))","v":"(Nm3: m3 onder standaard condities)"},null,null,{"$f":"IF($A$1=0,\"\",language!$A$83)","v":"kg/jaar"},{"$f":"IF($A$1=0,\"\",language!$A$85)","v":"kg/uur"},{"$f":"IF($A$1=0,\"\",language!$A$96)","v":"g/GJ"}]
[null,{"$f":"language!A40","v":"NOx"},null,899,null,{"$f":"IF($A$1=0,\"\",language!$A$83)","v":"kg/jaar"},{"$f":"IF($A$1=0,\"\",IF($M$32=\"\",\"\",IF(E31<>\"\",E31/$M$32*1000000,IF(D31=899,0,(1+(D31-TRUNC(D31/900)*900)/100)*10^(TRUNC(D31/900)-1)))))","v":0},{"$f":"IF(G31=\"\",\"\",language!$A$93)","v":"mg/Nm3"},null,{"$f":"IF(OR(A1<>1,M32=\"\"),\"\",G31*M32/1000000)","v":0},{"$f":"IF(AND(A1=1,F4<>0,F4<>\"\"),G31*M33/1000000,\"\")","v":0},{"$f":"IF(OR(A1=0,M22=0),\"\",J31/M22)","v":""},{"$f":"IF(M33=\"\",\"\",language!A46)","v":"droog"}]
[null,{"$f":"language!A38","v":"SO2"},null,899,null,{"$f":"IF($A$1=0,\"\",language!$A$83)","v":"kg/jaar"},{"$f":"IF($A$1=0,\"\",IF($M$32=\"\",\"\",IF(E32<>\"\",E32/$M$32*1000000,IF(D32=899,0,(1+(D32-TRUNC(D32/900)*900)/100)*10^(TRUNC(D32/900)-1)))))","v":0},{"$f":"IF(G32=\"\",\"\",language!$A$93)","v":"mg/Nm3"},null,{"$f":"IF(OR(A1<>1,M32=\"\",G32=\"\"),\"\",G32*M32/1000000)","v":0},{"$f":"IF(AND(A1=1,F4<>0,F4<>\"\"),G32*M33/1000000,\"\")","v":0},{"$f":"IF(OR($M$22=0,$A$1=0),\"\",J32/$M$22)","v":""},{"$f":"IF(A1=0,\"\",IF(M15<>0,M15*21/(21-G34),G34*G35*3600*F4*(100-G36)/100*273/(273+G37)))","v":315360.00000000006},{"$f":"language!A92","v":"Nm3/jaar"}]
[null,5,null,899,null,{"$f":"IF($A$1=0,\"\",language!$A$83)","v":"kg/jaar"},{"$f":"IF($A$1=0,\"\",IF($M$32=\"\",\"\",IF(E33<>\"\",E33/$M$32*1000000,IF(D33=899,0,(1+(D33-TRUNC(D33/900)*900)/100)*10^(TRUNC(D33/900)-4)))))","v":0},{"$f":"IF(G33=\"\",\"\",language!$A$93)","v":"mg/Nm3"},null,{"$f":"IF(OR(A1<>1,M32=\"\",G33=\"\"),\"\",G33*M32/1000000)","v":0},{"$f":"IF(AND(A1=1,F4<>0,F4<>\"\"),G33*M33/1000000,\"\")","v":0},{"$f":"IF(OR(A1=0,M22=0),\"\",J33/M22)","v":""},{"$f":"IF(AND(A1=1,F4<>\"\",F4<>0),M32/F4,\"\")","v":36.000000000000007},{"$f":"IF(M33=\"\",\"\",language!A84)","v":"Nm3/uur"}]
[null,{"$f":"IF(M22=0,language!A221,language!$A$37)","v":"Dwarsdoorsnede afgaskanaal"},null,900,null,{"$f":"IF(M22=0,language!A222,language!A91)","v":"m2"},{"$f":"IF(A1<>1,\"\",IF(M22<>0,IF(OR(E34<0,E34>=21,E34=\"\"),IF(D34>900,(D34-900)/430,IF(AND(E3>=4,E3<=7),15,IF(AND(F10<12,H10<12,J10<12,L10<12),3,6))),E34),IF(E34<>\"\",E34,(D34-890)/100)))","v":0.1},{"$f":"IF(M22=0,language!A222,language!A91)","v":"m2"},null,{"$f":"IF(J35=\"\",\"\",F35)","v":""},{"$f":"IF(K35=\"\",\"\",language!A88)","v":""},{"$f":"IF(L35=\"\",\"\",language!$A$95)","v":""},{"$f":"IF(M36=\"\",\"\",language!A47)","v":"nat"}]
[null,{"$f":"IF(M22=0,language!$A$227,language!A39)","v":"Afgassnelheid"},null,899,null,{"$f":"IF(M22=0,language!A228,language!A90)","v":"m/s"},{"$f":"IF($A$1=0,\"\",IF(J35=\"\",IF(E35<>\"\",E35,(D35-889)/100),K35*1000/44*22.4/M33*100))","v":0.1},{"$f":"IF(J35=\"\",language!A228,CONCATENATE(language!A91,IF(AND(D35=899,E35=\"\"),CONCATENATE(\" (\",language!A223,\")\"),\"\")))","v":"m/s"},null,{"$f":"IF(OR($A$1=0,M22=0),\"\",IF(E35<>\"\",E35,IF(D35=899,M21,(D35-900)/2000*M21)))","v":""},{"$f":"IF(AND($A$1=1,M22>0,F4<>0,F4<>\"\"),J35*1000/F4,\"\")","v":""},{"$f":"IF(OR($M$22=0,$A$1=0),\"\",J35*1000/$M$22)","v":""},{"$f":"IF(M32<>\"\",M32*100/(100-$G$36),\"\")","v":315360.00000000006},{"$f":"IF(M35=\"\",\"\",N32)","v":"Nm3/jaar"}]
[null,{"$f":"language!A149","v":"Waterdamp"},null,899,null,{"$f":"language!A91","v":"vol%"},{"$f":"IF(A1<>1,\"\",IF(E36<>\"\",E36,IF(D36<>899,(D36-900)/100,IF(M22=0,0,100*(M16-M15)/(M32+M16-M15)))))","v":0},{"$f":"IF(G36=\"\",\"\",CONCATENATE(language!A91,IF(AND(D36=899,E36=\"\",M22<>0),CONCATENATE(\" (\",language!A223,\")\"),\"\")))","v":"vol%"},null,{"$f":"IF(K36=\"\",\"\",language!A224)","v":""},{"$f":"IF(G36=0,\"\",TRUNC((19513.7/(17.433-LN(1013*G36/100)))^(1/1.27095)-273))","v":""},{"$f":"IF(K36=\"\",\"\",\"°C\")","v":""},{"$f":"IF(M33<>\"\",M33*100/(100-$G$36),\"\")","v":36.000000000000007},{"$f":"IF(M36=\"\",\"\",N33)","v":"Nm3/uur"}]
[null,{"$f":"language!A219","v":"Temperatuur"},null,0,null,"°C",{"$f":"IF(A1=0,\"\",IF(E37<>\"\",E37,D37))","v":0},{"$f":"IF(G37<>\"\",F37,\"\")","v":"°C"},null,null,null,null,{"$f":"IF(M36<>\"\",M36*((273+E37)/273)/3600,\"\")","v":1.0000000000000002E-2},{"$f":"IF(M37=\"\",\"\",language!A220)","v":"m3/s"}]

{"sheet":"Gaseous fuels","index":3,"n_rows":90,"n_cols":18,"rows_kept":90,"cut":false,"hidden":false,"merged":[]}
[{"$f":"IF(NOW()>Data!B2,0,1)","v":1}]
[null,null,{"$f":"language!A142","v":"Omschrijving"},{"$f":"language!A28","v":"AARDGAS"},"HC Gas","GF1","GF 2","GF 3"]
[null,{"$f":"language!A34","v":"Onderste verbrandingswaarde"},{"$f":"language!A71","v":"kJ/Nm3"},null,null,28000,35000,40000]
[null,{"$f":"language!A52","v":"Gehalte fossiele brandstof"},"%",100,100,100,100,100]
[null,{"$f":"B3","v":"Onderste verbrandingswaarde"},{"$f":"language!A70","v":"MJ/Nm3"},{"$f":"IF($A1=1,IF(D67=\"\",IF(D3=\"\",\"\",D3/1000),D67),\"\")","v":31.668546173147696},{"$f":"IF($A1=1,IF(E67=\"\",IF(E3=\"\",\"\",E3/1000),E67),\"\")","v":36.271670288908943},{"$f":"IF($A1=1,IF(F67=\"\",IF(F3=\"\",\"\",F3/1000),F67),\"\")","v":28},{"$f":"IF($A1=1,IF(G67=\"\",IF(G3=\"\",\"\",G3/1000),G67),\"\")","v":35},{"$f":"IF($A1=1,IF(H67=\"\",IF(H3=\"\",\"\",H3/1000),H67),\"\")","v":40}]
[null,{"$f":"language!A35","v":"Bovenste verbrandingswaarde"},{"$f":"C5","v":"MJ/Nm3"},{"$f":"IF(D64=\"\",IF(D5=\"\",\"\",D5+(D18-D17)*44.0136/21.629),D64)","v":35.094354942641466},{"$f":"IF(E64=\"\",IF(E5=\"\",\"\",E5+(E18-E17)*44.0136/21.629),E64)","v":40.165411579420812},{"$f":"IF(F64=\"\",IF(F5=\"\",\"\",F5+(F18-F17)*44.0136/21.629),F64)","v":31.123421084654861},{"$f":"IF(G64=\"\",IF(G5=\"\",\"\",G5+(G18-G17)*44.0136/21.629),G64)","v":38.943906706736321},{"$f":"IF(H64=\"\",IF(H5=\"\",\"\",H5+(H18-H17)*44.0136/21.629),H64)","v":44.529967865365947}]
[null,{"$f":"language!A36","v":"Wobbe-index"},{"$f":"C6","v":"MJ/Nm3"},{"$f":"IF(D65=\"\",IF(OR(D3=\"\",$A1=0),\"\",D6/SQRT(0.82/1.293)),D65)","v":43.706191188449452},{"$f":"IF(E65=\"\",IF(OR(E3=\"\",$A1=0),\"\",E6/SQRT(0.82/1.293)),E65)","v":50.933430463527955},{"$f":"IF(F65=\"\",IF(OR(F3=\"\",$A1=0),\"\",F6/SQRT(0.82/1.293)),F65)","v":39.082259568393766},{"$f":"IF(G65=\"\",IF(OR(G3=\"\",$A1=0),\"\",G6/SQRT(0.82/1.293)),G65)","v":48.902589030304156},{"$f":"IF(H65=\"\",IF(OR(H3=\"\",$A1=0),\"\",H6/SQRT(0.82/1.293)),H65)","v":55.917110074525873}]
[null,{"$f":"language!A33","v":"Berekeningsmethode"},null,{"$f":"IF(D66=\"\",IF(D5=\"\",\"\",language!$A$198),language!$A$199)","v":"samenstelling"},{"$f":"IF(E66=\"\",IF(E5=\"\",\"\",language!$A$198),language!$A$199)","v":"samenstelling"},{"$f":"IF(F66=\"\",IF(F5=\"\",\"\",language!$A$198),language!$A$199)","v":"DIN1942"},{"$f":"IF(G66=\"\",IF(G5=\"\",\"\",language!$A$198),language!$A$199)","v":"DIN1942"},{"$f":"IF(H66=\"\",IF(H5=\"\",\"\",language!$A$198),language!$A$199)","v":"DIN1942"}]
[null,{"$f":"language!A154","v":"Koolstofdioxide"},{"$f":"language!A80","v":"Nm3/Nm3"},{"$f":"IF(D8=\"\",\"\",IF(D8=language!$A$198,D84,D76))","v":0.89690470911101583},{"$f":"IF(E8=\"\",\"\",IF(E8=language!$A$198,E84,E76))","v":1.0403934365117815},{"$f":"IF(F8=\"\",\"\",IF(F8=language!$A$198,F84,F76))","v":0.86295999999999995},{"$f":"IF(G8=\"\",\"\",IF(G8=language!$A$198,G84,G76))","v":1.02095},{"$f":"IF(H8=\"\",\"\",IF(H8=language!$A$198,H84,H76))","v":1.1338000000000001}]
[null,null,{"$f":"language!A76","v":"kg/GJ"},{"$f":"IF(D9=\"\",\"\",D9/'Gaseous fuels'!$L$29*'Gaseous fuels'!$K$29*1000/D5)","v":56.029105319939347},{"$f":"IF(E9=\"\",\"\",E9/'Gaseous fuels'!$L$29*'Gaseous fuels'!$K$29*1000/E5)","v":56.744733211764981},{"$f":"IF(F9=\"\",\"\",F9/'Gaseous fuels'!$L$29*'Gaseous fuels'!$K$29*1000/F5)","v":60.97167755246987},{"$f":"IF(G9=\"\",\"\",G9/'Gaseous fuels'!$L$29*'Gaseous fuels'!$K$29*1000/G5)","v":57.707457307123505},{"$f":"IF(H9=\"\",\"\",H9/'Gaseous fuels'!$L$29*'Gaseous fuels'!$K$29*1000/H5)","v":56.075347184450322}]
[null,{"$f":"language!A149","v":"Waterdamp"},{"$f":"C9","v":"Nm3/Nm3"},{"$f":"IF(D8=\"\",\"\",IF(D8=language!$A$198,D85,D77))","v":1.6834064402803717},{"$f":"IF(E8=\"\",\"\",IF(E8=language!$A$198,E85,E77))","v":1.9133435653508015},{"$f":"IF(F8=\"\",\"\",IF(F8=language!$A$198,F85,F77))","v":1.6239999999999999},{"$f":"IF(G8=\"\",\"\",IF(G8=language!$A$198,G85,G77))","v":2.0496000000000003},{"$f":"IF(H8=\"\",\"\",IF(H8=language!$A$198,H85,H77))","v":2.3536000000000001}]
[null,{"$f":"language!A143","v":"Brandstofstikstof"},{"$f":"C11","v":"Nm3/Nm3"},{"$f":"IF(D8=\"\",\"\",IF(D8=language!$A$198,D86,D78))","v":0.14346345399677879},{"$f":"IF(E8=\"\",\"\",IF(E8=language!$A$198,E86,E78))","v":3.1282371321872893E-2},{"$f":"IF(F8=\"\",\"\",IF(F8=language!$A$198,F86,F78))","v":0},{"$f":"IF(G8=\"\",\"\",IF(G8=language!$A$198,G86,G78))","v":0},{"$f":"IF(H8=\"\",\"\",IF(H8=language!$A$198,H86,H78))","v":0}]
[null,{"$f":"language!A183","v":"Zwaveldioxide"},{"$f":"C12","v":"Nm3/Nm3"},{"$f":"IF(D8=\"\",\"\",IF(D8=language!$A$198,D87,D79))","v":0},{"$f":"IF(E8=\"\",\"\",IF(E8=language!$A$198,E87,E79))","v":0},{"$f":"IF(F8=\"\",\"\",IF(F8=language!$A$198,F87,F79))","v":0},{"$f":"IF(G8=\"\",\"\",IF(G8=language!$A$198,G87,G79))","v":0},{"$f":"IF(H8=\"\",\"\",IF(H8=language!$A$198,H87,H79))","v":0}]
[null,null,{"$f":"C10","v":"kg/GJ"},{"$f":"IF(D8=\"\",\"\",D13/22.4*64*1000/D5)","v":0},{"$f":"IF(E8=\"\",\"\",E13/22.4*64*1000/E5)","v":0},{"$f":"IF(F8=\"\",\"\",F13/22.4*64*1000/F5)","v":0},{"$f":"IF(G8=\"\",\"\",G13/22.4*64*1000/G5)","v":0},{"$f":"IF(H8=\"\",\"\",H13/22.4*64*1000/H5)","v":0}]
[null,{"$f":"language!A42","v":"Stoichiometrisch luchtverbruik"},{"$f":"C13","v":"Nm3/Nm3"},{"$f":"IF(D5=\"\",\"\",IF(D8=language!$A$198,D88,D80))","v":8.4287599138739484},{"$f":"IF(E5=\"\",\"\",IF(E8=language!$A$198,E88,E80))","v":9.6479476823136316},{"$f":"IF(F5=\"\",\"\",IF(F8=language!$A$198,F88,F80))","v":7.460700000000001},{"$f":"IF(G5=\"\",\"\",IF(G8=language!$A$198,G88,G80))","v":9.3360000000000003},{"$f":"IF(H5=\"\",\"\",IF(H8=language!$A$198,H88,H80))","v":10.675500000000001}]
[null,{"$f":"language!A45","v":"Stoichiometrisch rookgasvolume"}]
[null,{"$f":"CONCATENATE(\"  \",language!A46)","v":"  droog"},{"$f":"C15","v":"Nm3/Nm3"},{"$f":"IF(D5=\"\",\"\",IF(D8=language!$A$198,D89,D81))","v":7.70330287502515},{"$f":"IF(E5=\"\",\"\",IF(E8=language!$A$198,E89,E81))","v":8.698378450702581},{"$f":"IF(F5=\"\",\"\",IF(F8=language!$A$198,F89,F81))","v":6.7622},{"$f":"IF(G5=\"\",\"\",IF(G8=language!$A$198,G89,G81))","v":8.4030000000000005},{"$f":"IF(H5=\"\",\"\",IF(H8=language!$A$198,H89,H81))","v":9.5749999999999993}]
[null,{"$f":"CONCATENATE(\"  \",language!A47)","v":"  nat"},{"$f":"C17","v":"Nm3/Nm3"},{"$f":"IF(D5=\"\",\"\",IF(D8=language!$A$198,D90,D82))","v":9.3867093153055219},{"$f":"IF(E5=\"\",\"\",IF(E8=language!$A$198,E90,E82))","v":10.611722016053383},{"$f":"IF(F5=\"\",\"\",IF(F8=language!$A$198,F90,F82))","v":8.2971000000000004},{"$f":"IF(G5=\"\",\"\",IF(G8=language!$A$198,G90,G82))","v":10.341099999999999},{"$f":"IF(H5=\"\",\"\",IF(H8=language!$A$198,H90,H82))","v":11.8011},"cal. bovenwaarde","stookwaarde","molgewicht","mol.volume","comp.fact."]
[null,"Substance",{"$f":"language!A142","v":"Omschrijving"},{"$f":"D2","v":"AARDGAS"},{"$f":"E2","v":"HC Gas"},{"$f":"F2","v":"GF1"},{"$f":"G2","v":"GF 2"},{"$f":"H2","v":"GF 3"},"(MJ/kmol)","(MJ/kmol)",null,"(m03)",null,"C","H","O","N","S"]
[null,{"$f":"language!A145","v":"Helium"},"mol%",null,6.5000000000000002E-2,null,null,null,{"$f":"J20+O20*22.008","v":0},0,4.0026000000000002,22.424800000000001,-1.6E-2]
[null,{"$f":"language!A146","v":"Argon"},"mol%",null,null,null,null,null,{"$f":"J21+O21*22.008","v":0},0,39.948,22.392499999999998,3.1600000000000003E-2]
[null,{"$f":"language!A147","v":"Waterstofsulfide *"},"mol%",null,null,null,null,null,{"$f":"J22+O22*22.008","v":562.71600000000001},518.70000000000005,34.075800000000001,22.188099999999999,0.1,null,2,null,null,1]
[null,{"$f":"language!A148","v":"Waterstof"},"mol%",null,null,null,null,null,{"$f":"J23+O23*22.008","v":285.84300000000002},241.827,2.0158,22.435400000000001,0,null,2]
[null,{"$f":"language!A149","v":"Waterdamp"},"mol%",null,null,null,null,null,0,0,18.0152,21.629000000000001,0.17899999999999999,null,2,1]
[null,{"$f":"language!A150","v":"Stikstof"},"mol%",14.32,3.121,null,null,null,{"$f":"J25+O25*22.008","v":0},0,28.013400000000001,22.403700000000001,2.24E-2,null,null,null,2]
[null,{"$f":"language!A151","v":"Zuurstof"},"mol%",0.01,null,null,null,null,0,0,31.998799999999999,22.3919,3.1600000000000003E-2,null,null,2]
[null,{"$f":"language!A152","v":"Methaan"},"mol%",81.290000000000006,89.402000000000001,null,null,null,890.35200000000009,802.32,{"$f":"12.011*N27+1.0079*O27+15.9994*P27+14.0067*Q27+32.06*R27","v":16.0426},22.36,4.9000000000000002E-2,1,4]
[null,{"$f":"language!A153","v":"Koolstofmonoxide"},"mol%",null,null,null,null,null,282.98899999999998,282.98899999999998,28.010399999999997,22.399100000000001,2.6499999999999999E-2,1,null,1]
[null,{"$f":"language!A154","v":"Koolstofdioxide"},"mol%",0.89,1.7110000000000001,null,null,null,0,0,44.009799999999998,22.246099999999998,6.7000000000000004E-2,1,null,2]
[null,{"$f":"language!A155","v":"Ethaan"},"mol%",2.87,4.4379999999999997,null,null,null,1559.8779999999999,1427.83,30.069399999999998,22.1874,0.10150000000000001,2,6]
[null,{"$f":"language!A156","v":"Etheen *"},"mol%",null,null,null,null,null,1410.972,1322.94,28.053599999999999,{"$f":"1322.94/59.476","v":22.243257784652634},8.72E-2,2,4]
[null,{"$f":"language!A157","v":"Ethyn *"},"mol%",null,null,null,null,null,1308.2760000000001,1264.26,26.037799999999997,22.0425,7.1300000000000002E-2,2,2]
[null,{"$f":"language!A158","v":"Propaan"},"mol%",0.38,0.79700000000000004,null,null,null,2220.0740000000001,2044.01,44.096200000000003,21.9297,0.153,3,8]
[null,{"$f":"language!A159","v":"Propeen *"},"mol%",null,null,null,null,null,2058.4880000000003,1926.44,42.080399999999997,{"$f":"1926.44/87.607","v":21.989567043729384},0.13750000000000001,3,6]
[null,{"$f":"language!A160","v":"2-Methylpropaan"},"mol%",null,0.14399999999999999,null,null,null,2868.7599999999998,2648.68,58.122999999999998,21.610399999999998,0.20419999999999999,4,10]
[null,{"$f":"language!A161","v":"n-Butaan"},"mol%",0.15,0.14899999999999999,null,null,null,2877.13,2657.05,58.122999999999998,21.520499999999998,0.2112,4,10]
[null,{"$f":"language!A162","v":"Butadieen *"},"mol%",null,null,null,null,null,2593.7879999999996,2461.7399999999998,54.091399999999993,{"$f":"2461.74/114.175","v":21.561112327567329},0.20300000000000001,4,6]
[null,{"$f":"language!A163","v":"2,2-Dimethylpropaan"},"mol%",null,3.0000000000000001E-3,null,null,null,3516.6559999999999,3252.56,72.149799999999999,21.2866,0.22450000000000001,5,12]
[null,{"$f":"language!A164","v":"2-Methylbutaan"},"mol%",null,3.6999999999999998E-2,null,null,null,3528.1559999999999,3264.06,72.149799999999999,21.0838,0.2462,5,12]
[null,{"$f":"language!A165","v":"n-Pentaan"},"mol%",0.04,3.6999999999999998E-2,null,null,null,3536.1959999999999,3272.1,72.149799999999999,20.890699999999999,0.26100000000000001,5,12]
[null,{"$f":"language!A166","v":"Cyclopentaan *"},"mol%",null,2E-3,null,null,null,3294.24,3074.16,70.133999999999986,20.5,0.29220000000000002,5,10]
[null,{"$f":"language!A167","v":"2,2-Dimethylbutaan"},"mol%",null,3.0000000000000001E-3,null,null,null,4177.8919999999998,3869.78,86.176600000000008,20.5,0.29099999999999998,6,14]
[null,{"$f":"language!A168","v":"2,3-Dimethylbutaan"},"mol%",null,1.7000000000000001E-2,null,null,null,4185.9719999999998,3877.86,86.176600000000008,20.5,0.30459999999999998,6,14]
[null,{"$f":"language!A169","v":"3-Methylpentaan"},"mol%",null,1.2999999999999999E-2,null,null,null,4189.8220000000001,3881.71,86.176600000000008,20.5,0.31590000000000001,6,14]
[null,{"$f":"language!A170","v":"Cyclohexaan"},"mol%",null,null,null,null,null,3952.9659999999999,3688.87,84.160799999999995,20.5,0.31979999999999997,6,12]
[null,{"$f":"language!A171","v":"n-Hexaan"},"mol%",0.05,null,null,null,null,4194.9219999999996,3886.81,86.176600000000008,20.5,0.33169999999999999,6,14]
[null,{"$f":"language!A172","v":"Benzeen"},"mol%",null,4.5999999999999999E-2,null,null,null,3301.5079999999998,3169.46,78.113399999999999,20.5,0.30170000000000002,6,6]
[null,{"$f":"language!A173","v":"2-Methylhexaan"},"mol%",null,1E-3,null,null,null,4846.4979999999996,4494.37,100.2034,20.5,0.3926,7,16]
[null,{"$f":"language!A174","v":"3-Methylhexaan"},"mol%",null,4.0000000000000001E-3,null,null,null,4849.8879999999999,4497.76,100.2034,20.5,0.39279999999999998,7,16]
[null,{"$f":"language!A175","v":"n-Heptaan"},"mol%",null,4.0000000000000001E-3,null,null,null,4853.5679999999993,4501.4399999999996,100.2034,20.5,0.41410000000000002,7,16]
[null,{"$f":"language!A176","v":"Methylcyclohexaan"},"mol%",null,4.0000000000000001E-3,null,null,null,4600.6819999999998,4292.57,98.187600000000003,20.5,0.38969999999999999,7,14]
[null,{"$f":"language!A177","v":"Tolueen"},"mol%",null,2E-3,null,null,null,3947.944,3771.88,92.140199999999993,20.5,0.3901,7,8]
[null,{"$f":"language!A178","v":"2-Methylheptaan *"},"mol%",null,null,null,null,null,5504.7139999999999,5108.57,114.2302,20.5,0.4955,8,18]
[null,{"$f":"language!A179","v":"2,2,4-Trimethylpentaan"},"mol%",null,null,null,null,null,5496.5240000000003,5100.38,114.2302,20.5,0.41959999999999997,8,18]
[null,{"$f":"language!A180","v":"n-Octaan"},"mol%",null,1E-3,null,null,null,5511.7139999999999,5115.57,114.2302,20.5,0.51259999999999994,8,18]
[null,{"$f":"language!A181","v":"Totaal"},"mol%",{"$f":"SUM(D20:D55)/100","v":1.0000000000000002},{"$f":"SUM(E20:E55)/100","v":1.0000100000000003},{"$f":"SUM(F20:F55)/100","v":0},{"$f":"SUM(G20:G55)/100","v":0},{"$f":"SUM(H20:H55)/100","v":0}]
[null,{"$f":"language!A182","v":"(*: verbinding niet genoemd in ISO 6976)"},null,null,null,null,null,null,null,null,null,null,null,"niet uit ISO 6976"]
[null,{"$f":"language!A184","v":"mol C/mol"},null,{"$f":"IF($A1=1,IF(D63=\"\",\"\",SUMPRODUCT(D20:D55,$N$20:$N$55)/100),\"\")","v":0.90159999999999996},{"$f":"IF($A1=1,IF(E63=\"\",\"\",SUMPRODUCT(E20:E55,$N$20:$N$55)/100),\"\")","v":1.0453400000000004},{"$f":"IF($A1=1,IF(F63=\"\",\"\",SUMPRODUCT(F20:F55,$N$20:$N$55)/100),\"\")","v":""},{"$f":"IF($A1=1,IF(G63=\"\",\"\",SUMPRODUCT(G20:G55,$N$20:$N$55)/100),\"\")","v":""},{"$f":"IF($A1=1,IF(H63=\"\",\"\",SUMPRODUCT(H20:H55,$N$20:$N$55)/100),\"\")","v":""}]
[null,{"$f":"language!A185","v":"mol H/mol"},null,{"$f":"IF(D58=\"\",\"\",SUMPRODUCT(D20:D55,$O$20:$O$55)/100)","v":3.4810000000000003},{"$f":"IF(E58=\"\",\"\",SUMPRODUCT(E20:E55,$O$20:$O$55)/100)","v":3.9545800000000004},{"$f":"IF(F58=\"\",\"\",SUMPRODUCT(F20:F55,$O$20:$O$55)/100)","v":""},{"$f":"IF(G58=\"\",\"\",SUMPRODUCT(G20:G55,$O$20:$O$55)/100)","v":""},{"$f":"IF(H58=\"\",\"\",SUMPRODUCT(H20:H55,$O$20:$O$55)/100)","v":""}]
[null,{"$f":"language!A186","v":"mol O/mol"},null,{"$f":"IF(D58=\"\",\"\",SUMPRODUCT(D20:D55,$P$20:$P$55)/100)","v":1.8000000000000002E-2},{"$f":"IF(E58=\"\",\"\",SUMPRODUCT(E20:E55,$P$20:$P$55)/100)","v":3.422E-2},{"$f":"IF(F58=\"\",\"\",SUMPRODUCT(F20:F55,$P$20:$P$55)/100)","v":""},{"$f":"IF(G58=\"\",\"\",SUMPRODUCT(G20:G55,$P$20:$P$55)/100)","v":""},{"$f":"IF(H58=\"\",\"\",SUMPRODUCT(H20:H55,$P$20:$P$55)/100)","v":""}]
[null,{"$f":"language!A187","v":"mol N/mol"},null,{"$f":"IF(D58=\"\",\"\",SUMPRODUCT(D20:D55,$Q$20:$Q$55)/100)","v":0.28639999999999999},{"$f":"IF(E58=\"\",\"\",SUMPRODUCT(E20:E55,$Q$20:$Q$55)/100)","v":6.2420000000000003E-2},{"$f":"IF(F58=\"\",\"\",SUMPRODUCT(F20:F55,$Q$20:$Q$55)/100)","v":""},{"$f":"IF(G58=\"\",\"\",SUMPRODUCT(G20:G55,$Q$20:$Q$55)/100)","v":""},{"$f":"IF(H58=\"\",\"\",SUMPRODUCT(H20:H55,$Q$20:$Q$55)/100)","v":""}]
[null,{"$f":"language!A188","v":"mol S/mol"},null,{"$f":"IF(D58=\"\",\"\",SUMPRODUCT(D20:D55,$R$20:$R$55)/100)","v":0},{"$f":"IF(E58=\"\",\"\",SUMPRODUCT(E20:E55,$R$20:$R$55)/100)","v":0},{"$f":"IF(F58=\"\",\"\",SUMPRODUCT(F20:F55,$R$20:$R$55)/100)","v":""},{"$f":"IF(G58=\"\",\"\",SUMPRODUCT(G20:G55,$R$20:$R$55)/100)","v":""},{"$f":"IF(H58=\"\",\"\",SUMPRODUCT(H20:H55,$R$20:$R$55)/100)","v":""}]
[null,{"$f":"language!A35","v":"Bovenste verbrandingswaarde"},{"$f":"language!A74","v":"MJ/kmol"},{"$f":"IF($A1=1,IF(SUMPRODUCT(D20:D55,$I$20:$I$55)=0,\"\",SUMPRODUCT(D20:D55,$I$20:$I$55)/100),\"\")","v":784.79955500000005},{"$f":"IF($A1=1,IF(SUMPRODUCT(E20:E55,$I$20:$I$55)=0,\"\",SUMPRODUCT(E20:E55,$I$20:$I$55)/100),\"\")","v":897.77203234000012},{"$f":"IF($A1=1,IF(SUMPRODUCT(F20:F55,$I$20:$I$55)=0,\"\",SUMPRODUCT(F20:F55,$I$20:$I$55)/100),\"\")","v":""},{"$f":"IF($A1=1,IF(SUMPRODUCT(G20:G55,$I$20:$I$55)=0,\"\",SUMPRODUCT(G20:G55,$I$20:$I$55)/100),\"\")","v":""},{"$f":"IF($A1=1,IF(SUMPRODUCT(H20:H55,$I$20:$I$55)=0,\"\",SUMPRODUCT(H20:H55,$I$20:$I$55)/100),\"\")","v":""}]
[null,null,{"$f":"C3","v":"kJ/Nm3"},{"$f":"IF(D63=\"\",\"\",D63/D70)","v":35.094354942641466},{"$f":"IF(E63=\"\",\"\",E63/E70)","v":40.165411579420812},{"$f":"IF(F63=\"\",\"\",F63/F70)","v":""},{"$f":"IF(G63=\"\",\"\",G63/G70)","v":""},{"$f":"IF(H63=\"\",\"\",H63/H70)","v":""}]
[null,{"$f":"language!A36","v":"Wobbe-index"},{"$f":"C64","v":"kJ/Nm3"},{"$f":"IF(D64=\"\",\"\",D64/SQRT(D73))","v":43.706191188449452},{"$f":"IF(E64=\"\",\"\",E64/SQRT(E73))","v":50.933430463527955},{"$f":"IF(F64=\"\",\"\",F64/SQRT(F73))","v":""},{"$f":"IF(G64=\"\",\"\",G64/SQRT(G73))","v":""},{"$f":"IF(H64=\"\",\"\",H64/SQRT(H73))","v":""}]
[null,{"$f":"language!A34","v":"Onderste verbrandingswaarde"},{"$f":"C63","v":"MJ/kmol"},{"$f":"IF(D63=\"\",\"\",SUMPRODUCT(D20:D55,$J$20:$J$55)/100)","v":708.18970700000023},{"$f":"IF(E63=\"\",\"\",SUMPRODUCT(E20:E55,$J$20:$J$55)/100)","v":810.73963569999989},{"$f":"IF(F63=\"\",\"\",SUMPRODUCT(F20:F55,$J$20:$J$55)/100)","v":""},{"$f":"IF(G63=\"\",\"\",SUMPRODUCT(G20:G55,$J$20:$J$55)/100)","v":""},{"$f":"IF(H63=\"\",\"\",SUMPRODUCT(H20:H55,$J$20:$J$55)/100)","v":""}]
[null,null,{"$f":"C65","v":"kJ/Nm3"},{"$f":"IF(D66=\"\",\"\",D66/D70)","v":31.668546173147696},{"$f":"IF(E66=\"\",\"\",E66/E70)","v":36.271670288908943},{"$f":"IF(F66=\"\",\"\",F66/F70)","v":""},{"$f":"IF(G66=\"\",\"\",G66/G70)","v":""},{"$f":"IF(H66=\"\",\"\",H66/H70)","v":""}]
[null,{"$f":"language!A189","v":"Molgewicht"},null,{"$f":"IF(D63=\"\",\"\",SUMPRODUCT(D20:D55,$K$20:$K$55)/100)","v":18.637125580000003},{"$f":"IF(E63=\"\",\"\",SUMPRODUCT(E20:E55,$K$20:$K$55)/100)","v":17.965799294000004},{"$f":"IF(F63=\"\",\"\",SUMPRODUCT(F20:F55,$K$20:$K$55)/100)","v":""},{"$f":"IF(G63=\"\",\"\",SUMPRODUCT(G20:G55,$K$20:$K$55)/100)","v":""},{"$f":"IF(H63=\"\",\"\",SUMPRODUCT(H20:H55,$K$20:$K$55)/100)","v":""}]
[null,{"$f":"language!A190","v":"Compressibiliteit"},null,{"$f":"IF(D63=\"\",\"\",1-(SUMPRODUCT(D20:D55,$M$20:$M$55)/100)^2+0.0005*(0.02*D23-D23*D23/10000))","v":0.99772273097385245},{"$f":"IF(E63=\"\",\"\",1-(SUMPRODUCT(E20:E55,$M$20:$M$55)/100)^2+0.0005*(0.02*E23-E23*E23/10000))","v":0.99724583994367155},{"$f":"IF(F63=\"\",\"\",1-(SUMPRODUCT(F20:F55,$M$20:$M$55)/100)^2+0.0005*(0.02*F23-F23*F23/10000))","v":""},{"$f":"IF(G63=\"\",\"\",1-(SUMPRODUCT(G20:G55,$M$20:$M$55)/100)^2+0.0005*(0.02*G23-G23*G23/10000))","v":""},{"$f":"IF(H63=\"\",\"\",1-(SUMPRODUCT(H20:H55,$M$20:$M$55)/100)^2+0.0005*(0.02*H23-H23*H23/10000))","v":""}]
[null,{"$f":"language!A191","v":"Molair volume op basis van compressibiliteit"},null,{"$f":"IF(D69=\"\",\"\",D69*22.4136)","v":22.362558202955537},{"$f":"IF(E69=\"\",\"\",E69*22.4136)","v":22.351869358161476},{"$f":"IF(F69=\"\",\"\",F69*22.4136)","v":""},{"$f":"IF(G69=\"\",\"\",G69*22.4136)","v":""},{"$f":"IF(H69=\"\",\"\",H69*22.4136)","v":""}]
[null,{"$f":"language!A192","v":",,  ,, op individuele molaire volumes"},null,{"$f":"IF(D63=\"\",\"\",SUMPRODUCT(D20:D55,$L$20:$L$55)/100)","v":22.355881589999999},{"$f":"IF(E63=\"\",\"\",SUMPRODUCT(E20:E55,$L$20:$L$55)/100)","v":22.343408773},{"$f":"IF(F63=\"\",\"\",SUMPRODUCT(F20:F55,$L$20:$L$55)/100)","v":""},{"$f":"IF(G63=\"\",\"\",SUMPRODUCT(G20:G55,$L$20:$L$55)/100)","v":""},{"$f":"IF(H63=\"\",\"\",SUMPRODUCT(H20:H55,$L$20:$L$55)/100)","v":""}]
[null,{"$f":"language!A193","v":"Dichtheid"},{"$f":"language!A78","v":"kg/Nm3"},{"$f":"IF(D71=\"\",\"\",D68/D71)","v":0.83365648118017266},{"$f":"IF(E71=\"\",\"\",E68/E71)","v":0.80407602423270597},{"$f":"IF(F71=\"\",\"\",F68/F71)","v":""},{"$f":"IF(G71=\"\",\"\",G68/G71)","v":""},{"$f":"IF(H71=\"\",\"\",H68/H71)","v":""}]
[null,{"$f":"language!A194","v":"Relatieve dichtheid"},null,{"$f":"IF(D72=\"\",\"\",D72/1.293)","v":0.64474592512000983},{"$f":"IF(E72=\"\",\"\",E72/1.293)","v":0.62186854155661719},{"$f":"IF(F72=\"\",\"\",F72/1.293)","v":""},{"$f":"IF(G72=\"\",\"\",G72/1.293)","v":""},{"$f":"IF(H72=\"\",\"\",H72/1.293)","v":""}]
[null,{"$f":"language!A195","v":"Stoichiometrisch verbranding"}]
[null,{"$f":"language!A196","v":"Zuurstofverbruik (mol/mol)"},null,{"$f":"IF(D63=\"\",\"\",(D58+D59/4-D60/2+D62))","v":1.7628500000000003},{"$f":"IF(E63=\"\",\"\",(E58+E59/4-E60/2+E62))","v":2.0168750000000002},{"$f":"IF(F63=\"\",\"\",(F58+F59/4-F60/2+F62))","v":""},{"$f":"IF(G63=\"\",\"\",(G58+G59/4-G60/2+G62))","v":""},{"$f":"IF(H63=\"\",\"\",(H58+H59/4-H60/2+H62))","v":""}]
[null,{"$f":"language!A154","v":"Koolstofdioxide"},{"$f":"C9","v":"Nm3/Nm3"},{"$f":"IF(D58=\"\",\"\",D58*$L$29/D$70)","v":0.89690470911101583},{"$f":"IF(E58=\"\",\"\",E58*$L$29/E$70)","v":1.0403934365117815},{"$f":"IF(F58=\"\",\"\",F58*$L$29/F$70)","v":""},{"$f":"IF(G58=\"\",\"\",G58*$L$29/G$70)","v":""},{"$f":"IF(H58=\"\",\"\",H58*$L$29/H$70)","v":""}]
[null,{"$f":"language!A149","v":"Waterdamp"},{"$f":"C76","v":"Nm3/Nm3"},{"$f":"IF(D59=\"\",\"\",D59/2*$L$24/D70)","v":1.6834064402803717},{"$f":"IF(E59=\"\",\"\",E59/2*$L$24/E70)","v":1.9133435653508015},{"$f":"IF(F59=\"\",\"\",F59/2*$L$24/F70)","v":""},{"$f":"IF(G59=\"\",\"\",G59/2*$L$24/G70)","v":""},{"$f":"IF(H59=\"\",\"\",H59/2*$L$24/H70)","v":""}]
[null,{"$f":"language!A143","v":"Brandstofstikstof"},"Nm3/Nm3",{"$f":"IF(D61=\"\",\"\",D61/2*$L$25/D70)","v":0.14346345399677879},{"$f":"IF(E61=\"\",\"\",E61/2*$L$25/E70)","v":3.1282371321872893E-2},{"$f":"IF(F61=\"\",\"\",F61/2*$L$25/F70)","v":""},{"$f":"IF(G61=\"\",\"\",G61/2*$L$25/G70)","v":""},{"$f":"IF(H61=\"\",\"\",H61/2*$L$25/H70)","v":""}]
[null,{"$f":"language!A183","v":"Zwaveldioxide"},"Nm3/Nm3",{"$f":"IF(D62=\"\",\"\",D62*22.4/D70)","v":0},{"$f":"IF(E62=\"\",\"\",E62*22.4/E70)","v":0},{"$f":"IF(F62=\"\",\"\",F62*22.4/F70)","v":""},{"$f":"IF(G62=\"\",\"\",G62*22.4/G70)","v":""},{"$f":"IF(H62=\"\",\"\",H62*22.4/H70)","v":""}]
[null,{"$f":"language!A43","v":"Droog luchtverbruik"},"Nm3/Nm3",{"$f":"IF(D75=\"\",\"\",D75/0.2095*22.4003/D70)","v":8.4287599138739484},{"$f":"IF(E75=\"\",\"\",E75/0.2095*22.4003/E70)","v":9.6479476823136316},{"$f":"IF(F75=\"\",\"\",F75/0.2095*22.4003/F70)","v":""},{"$f":"IF(G75=\"\",\"\",G75/0.2095*22.4003/G70)","v":""},{"$f":"IF(H75=\"\",\"\",H75/0.2095*22.4003/H70)","v":""}]
[null,{"$f":"language!A57","v":"Rookgasdebiet (droog)"},"Nm3/Nm3",{"$f":"IF(D80=\"\",\"\",D80*(1-0.2095)+D76+D78+D79)","v":7.70330287502515},{"$f":"IF(E80=\"\",\"\",E80*(1-0.2095)+E76+E78+E79)","v":8.698378450702581},{"$f":"IF(F80=\"\",\"\",F80*(1-0.2095)+F76+F78+F79)","v":""},{"$f":"IF(G80=\"\",\"\",G80*(1-0.2095)+G76+G78+G79)","v":""},{"$f":"IF(H80=\"\",\"\",H80*(1-0.2095)+H76+H78+H79)","v":""}]
[null,{"$f":"language!A58","v":"Rookgasdebiet (nat)"},"Nm3/Nm3",{"$f":"IF(D81=\"\",\"\",D81+D77)","v":9.3867093153055219},{"$f":"IF(E81=\"\",\"\",E81+E77)","v":10.611722016053383},{"$f":"IF(F81=\"\",\"\",F81+F77)","v":""},{"$f":"IF(G81=\"\",\"\",G81+G77)","v":""},{"$f":"IF(H81=\"\",\"\",H81+H77)","v":""}]
[null,{"$f":"language!A198","v":"DIN1942"}]
[null,{"$f":"B76","v":"Koolstofdioxide"},{"$f":"C82","v":"Nm3/Nm3"},{"$f":"IF(D5=\"\",\"\",0.231+0.02257*D5)","v":0.94575908712794343},{"$f":"IF(E5=\"\",\"\",0.231+0.02257*E5)","v":1.0496515984206749},{"$f":"IF(F5=\"\",\"\",0.231+0.02257*F5)","v":0.86295999999999995},{"$f":"IF(G5=\"\",\"\",0.231+0.02257*G5)","v":1.02095},{"$f":"IF(H5=\"\",\"\",0.231+0.02257*H5)","v":1.1338000000000001}]
[null,"Waterdamp",{"$f":"C82","v":"Nm3/Nm3"},{"$f":"IF(D5=\"\",\"\",-0.0784+0.0608*D5)","v":1.8470476073273798},{"$f":"IF(E5=\"\",\"\",-0.0784+0.0608*E5)","v":2.1269175535656641},{"$f":"IF(F5=\"\",\"\",-0.0784+0.0608*F5)","v":1.6239999999999999},{"$f":"IF(G5=\"\",\"\",-0.0784+0.0608*G5)","v":2.0496000000000003},{"$f":"IF(H5=\"\",\"\",-0.0784+0.0608*H5)","v":2.3536000000000001}]
[null,"Brandstofstikstof",{"$f":"C85","v":"Nm3/Nm3"},{"$f":"IF(D5=\"\",\"\",0)","v":0},{"$f":"IF(E5=\"\",\"\",0)","v":0},{"$f":"IF(F5=\"\",\"\",0)","v":0},{"$f":"IF(G5=\"\",\"\",0)","v":0},{"$f":"IF(H5=\"\",\"\",0)","v":0}]
[null,"Zwaveldioxide",{"$f":"C86","v":"Nm3/Nm3"},{"$f":"IF(D5=\"\",\"\",0)","v":0},{"$f":"IF(E5=\"\",\"\",0)","v":0},{"$f":"IF(F5=\"\",\"\",0)","v":0},{"$f":"IF(G5=\"\",\"\",0)","v":0},{"$f":"IF(H5=\"\",\"\",0)","v":0}]
[null,"Droog luchtverbruik",{"$f":"C87","v":"Nm3/Nm3"},{"$f":"IF(D5=\"\",\"\",-0.0405+0.2679*D5)","v":8.4435035197862689},{"$f":"IF(E5=\"\",\"\",-0.0405+0.2679*E5)","v":9.6766804703987077},{"$f":"IF(F5=\"\",\"\",-0.0405+0.2679*F5)","v":7.460700000000001},{"$f":"IF(G5=\"\",\"\",-0.0405+0.2679*G5)","v":9.3360000000000003},{"$f":"IF(H5=\"\",\"\",-0.0405+0.2679*H5)","v":10.675500000000001}]
[null,"Rookgasdebiet (droog)",{"$f":"C88","v":"Nm3/Nm3"},{"$f":"IF(D5=\"\",\"\",0.199+0.2344*D5)","v":7.6221072229858198},{"$f":"IF(E5=\"\",\"\",0.199+0.2344*E5)","v":8.7010795157202558},{"$f":"IF(F5=\"\",\"\",0.199+0.2344*F5)","v":6.7622},{"$f":"IF(G5=\"\",\"\",0.199+0.2344*G5)","v":8.4030000000000005},{"$f":"IF(H5=\"\",\"\",0.199+0.2344*H5)","v":9.5749999999999993}]
[null,"Rookgasdebiet (nat)",{"$f":"C89","v":"Nm3/Nm3"},{"$f":"IF(D5=\"\",\"\",0.1211+0.292*D5)","v":9.3683154825591277},{"$f":"IF(E5=\"\",\"\",0.1211+0.292*E5)","v":10.712427724361412},{"$f":"IF(F5=\"\",\"\",0.1211+0.292*F5)","v":8.2971000000000004},{"$f":"IF(G5=\"\",\"\",0.1211+0.292*G5)","v":10.341099999999999},{"$f":"IF(H5=\"\",\"\",0.1211+0.292*H5)","v":11.8011}]

{"sheet":"Liquid fuels","index":4,"n_rows":51,"n_cols":8,"rows_kept":51,"cut":false,"hidden":false,"merged":[]}
[{"$f":"IF(NOW()>Data!B2,0,1)","v":1}]
[null,null,{"$f":"'Gaseous fuels'!C2","v":"Omschrijving"},{"$f":"language!A29","v":"DIESEL"},{"$f":"language!A30","v":"HFO"},{"$f":"language!A31","v":"LFO"},"LF1","LF 2"]
[null,{"$f":"'Gaseous fuels'!B3","v":"Onderste verbrandingswaarde"},{"$f":"language!A73","v":"kJ/kg"},42480,40230,42650,41000,45000]
[null,{"$f":"'Gaseous fuels'!B4","v":"Gehalte fossiele brandstof"},"%",100,100,100,100,100]
[null,{"$f":"'Gaseous fuels'!B5","v":"Onderste verbrandingswaarde"},{"$f":"language!A72","v":"MJ/kg"},{"$f":"IF($A1=1,IF(D3=\"\",\"\",D3/1000),\"\")","v":42.48},{"$f":"IF($A1=1,IF(E3=\"\",\"\",E3/1000),\"\")","v":40.229999999999997},{"$f":"IF($A1=1,IF(F3=\"\",\"\",F3/1000),\"\")","v":42.65},{"$f":"IF($A1=1,IF(G3=\"\",\"\",G3/1000),\"\")","v":41},{"$f":"IF($A1=1,IF(H3=\"\",\"\",H3/1000),\"\")","v":45}]
[null,{"$f":"'Gaseous fuels'!B6","v":"Bovenste verbrandingswaarde"},{"$f":"C5","v":"MJ/kg"},{"$f":"IF(D5=\"\",\"\",D5+(D18-D17)*44.0136/21.629)","v":45.340294473658098},{"$f":"IF(E5=\"\",\"\",E5+(E18-E17)*44.0136/21.629)","v":42.513868717134635},{"$f":"IF(F5=\"\",\"\",F5+(F18-F17)*44.0136/21.629)","v":45.569247107848},{"$f":"IF(G5=\"\",\"\",G5+(G18-G17)*44.0136/21.629)","v":43.758557314716349},{"$f":"IF(H5=\"\",\"\",H5+(H18-H17)*44.0136/21.629)","v":48.505785291969111}]
[null,{"$f":"'Gaseous fuels'!B7","v":"Wobbe-index"},{"$f":"C6","v":"MJ/kg"}]
[null,{"$f":"'Gaseous fuels'!B8","v":"Berekeningsmethode"},null,{"$f":"IF($A1=1,IF(OR(D29=0,D29=\"\"),IF(D3=\"\",\"\",language!$A$198),language!$A$199),\"\")","v":"samenstelling"},{"$f":"IF($A1=1,IF(OR(E29=0,E29=\"\"),IF(E3=\"\",\"\",language!$A$198),language!$A$199),\"\")","v":"samenstelling"},{"$f":"IF($A1=1,IF(OR(F29=0,F29=\"\"),IF(F3=\"\",\"\",language!$A$198),language!$A$199),\"\")","v":"samenstelling"},{"$f":"IF($A1=1,IF(OR(G29=0,G29=\"\"),IF(G3=\"\",\"\",language!$A$198),language!$A$199),\"\")","v":"DIN1942"},{"$f":"IF($A1=1,IF(OR(H29=0,H29=\"\"),IF(H3=\"\",\"\",language!$A$198),language!$A$199),\"\")","v":"DIN1942"}]
[null,{"$f":"'Gaseous fuels'!B9","v":"Koolstofdioxide"},{"$f":"language!A81","v":"Nm3/kg"},{"$f":"IF(D$8=\"\",\"\",IF(D$8=language!$A$198,D45,D37))","v":1.5965480143202064},{"$f":"IF(E$8=\"\",\"\",IF(E$8=language!$A$198,E45,E37))","v":1.5850647223378569},{"$f":"IF(F$8=\"\",\"\",IF(F$8=language!$A$198,F45,F37))","v":1.5987705869619515},{"$f":"IF(G$8=\"\",\"\",IF(G$8=language!$A$198,G45,G37))","v":1.574022},{"$f":"IF(H$8=\"\",\"\",IF(H$8=language!$A$198,H45,H37))","v":1.6113900000000001}]
[null,null,{"$f":"language!A76","v":"kg/GJ"},{"$f":"IF(OR(D9=\"\",D5=\"\"),\"\",D9/'Gaseous fuels'!$L$29*'Gaseous fuels'!$K$29*1000/D5)","v":74.352056597209},{"$f":"IF(OR(E9=\"\",E5=\"\"),\"\",E9/'Gaseous fuels'!$L$29*'Gaseous fuels'!$K$29*1000/E5)","v":77.94575669957689},{"$f":"IF(OR(F9=\"\",F5=\"\"),\"\",F9/'Gaseous fuels'!$L$29*'Gaseous fuels'!$K$29*1000/F5)","v":74.15878812924808},{"$f":"IF(OR(G9=\"\",G5=\"\"),\"\",G9/'Gaseous fuels'!$L$29*'Gaseous fuels'!$K$29*1000/G5)","v":75.949068426025022},{"$f":"IF(OR(H9=\"\",H5=\"\"),\"\",H9/'Gaseous fuels'!$L$29*'Gaseous fuels'!$K$29*1000/H5)","v":70.840833146783794}]
[null,{"$f":"'Gaseous fuels'!B11","v":"Waterdamp"},{"$f":"C9","v":"Nm3/kg"},{"$f":"IF(D$8=\"\",\"\",IF(D$8=language!$A$198,D46,D38))","v":1.4055952971524954},{"$f":"IF(E$8=\"\",\"\",IF(E$8=language!$A$198,E46,E38))","v":1.1223302907034429},{"$f":"IF(F$8=\"\",\"\",IF(F$8=language!$A$198,F46,F38))","v":1.4345655819029668},{"$f":"IF(G$8=\"\",\"\",IF(G$8=language!$A$198,G46,G38))","v":1.3556000000000004},{"$f":"IF(H$8=\"\",\"\",IF(H$8=language!$A$198,H46,H38))","v":1.7228000000000003}]
[null,{"$f":"'Gaseous fuels'!B12","v":"Brandstofstikstof"},{"$f":"C11","v":"Nm3/kg"},{"$f":"IF(D$8=\"\",\"\",IF(D$8=language!$A$198,D47,D39))","v":7.9974940564158575E-7},{"$f":"IF(E$8=\"\",\"\",IF(E$8=language!$A$198,E47,E39))","v":3.1989976225663439E-5},{"$f":"IF(F$8=\"\",\"\",IF(F$8=language!$A$198,F47,F39))","v":0},{"$f":"IF(G$8=\"\",\"\",IF(G$8=language!$A$198,G47,G39))","v":0},{"$f":"IF(H$8=\"\",\"\",IF(H$8=language!$A$198,H47,H39))","v":0}]
[null,{"$f":"'Gaseous fuels'!B13","v":"Zwaveldioxide"},{"$f":"C12","v":"Nm3/kg"},{"$f":"IF(D$8=\"\",\"\",IF(D$8=language!$A$198,D48,D40))","v":1.2576419213973797E-3},{"$f":"IF(E$8=\"\",\"\",IF(E$8=language!$A$198,E48,E40))","v":2.326637554585153E-2},{"$f":"IF(F$8=\"\",\"\",IF(F$8=language!$A$198,F48,F40))","v":1.1877729257641918E-3},{"$f":"IF(G$8=\"\",\"\",IF(G$8=language!$A$198,G48,G40))","v":0},{"$f":"IF(H$8=\"\",\"\",IF(H$8=language!$A$198,H48,H40))","v":0}]
[null,null,{"$f":"C10","v":"kg/GJ"},{"$f":"IF(D8=\"\",\"\",D13/22.4*64*1000/D5)","v":8.4587161783520298E-2},{"$f":"IF(E8=\"\",\"\",E13/22.4*64*1000/E5)","v":1.6523827666525714},{"$f":"IF(F8=\"\",\"\",F13/22.4*64*1000/F5)","v":7.9569447379949212E-2},{"$f":"IF(G8=\"\",\"\",G13/22.4*64*1000/G5)","v":0},{"$f":"IF(H8=\"\",\"\",H13/22.4*64*1000/H5)","v":0}]
[null,{"$f":"'Gaseous fuels'!B15","v":"Stoichiometrisch luchtverbruik"},{"$f":"C13","v":"Nm3/kg"},{"$f":"IF(D$8=\"\",\"\",IF(D$8=language!$A$198,D49,D41))","v":11.136479602049928},{"$f":"IF(E$8=\"\",\"\",IF(E$8=language!$A$198,E49,E41))","v":10.482638163915775},{"$f":"IF(F$8=\"\",\"\",IF(F$8=language!$A$198,F49,F41))","v":11.231129879321681},{"$f":"IF(G$8=\"\",\"\",IF(G$8=language!$A$198,G49,G41))","v":10.636400000000002},{"$f":"IF(H$8=\"\",\"\",IF(H$8=language!$A$198,H49,H41))","v":11.706400000000002}]
[null,{"$f":"'Gaseous fuels'!B16","v":"Stoichiometrisch rookgasvolume"}]
[null,{"$f":"'Gaseous fuels'!B17","v":"  droog"},{"$f":"C15","v":"Nm3/kg"},{"$f":"IF(D8=\"\",\"\",IF(D8=language!$A$198,D50,D42))","v":10.401193581411476},{"$f":"IF(E8=\"\",\"\",IF(E8=language!$A$198,E50,E42))","v":9.8948885564353528},{"$f":"IF(F8=\"\",\"\",IF(F8=language!$A$198,F50,F42))","v":10.478166529491505},{"$f":"IF(G8=\"\",\"\",IF(G8=language!$A$198,G50,G42))","v":9.9817999999999998},{"$f":"IF(H8=\"\",\"\",IF(H8=language!$A$198,H50,H42))","v":10.865}]
[null,{"$f":"'Gaseous fuels'!B18","v":"  nat"},{"$f":"C17","v":"Nm3/kg"},{"$f":"IF(D8=\"\",\"\",IF(D8=language!$A$198,D51,D43))","v":11.806788878563971},{"$f":"IF(E8=\"\",\"\",IF(E8=language!$A$198,E51,E43))","v":11.017218847138796},{"$f":"IF(F8=\"\",\"\",IF(F8=language!$A$198,F51,F43))","v":11.912732111394472},{"$f":"IF(G8=\"\",\"\",IF(G8=language!$A$198,G51,G43))","v":11.337399999999999},{"$f":"IF(H8=\"\",\"\",IF(H8=language!$A$198,H51,H43))","v":12.5878}]
[null,{"$f":"language!A200","v":"mol C/kg"}]
[null,{"$f":"language!A201","v":"mol H/kg"}]
[null,{"$f":"language!A202","v":"mol N/kg"}]
[null,{"$f":"language!A203","v":"mol S/kg"}]
[null,{"$f":"language!A204","v":"mol O/kg"}]
[null,{"$f":"language!A205","v":"C (gew%)"},null,0.86199999999999999,0.85580000000000001,0.86319999999999997]
[null,{"$f":"language!A206","v":"H (gew%)"},null,0.13100000000000001,0.1046,0.13370000000000001]
[null,{"$f":"language!A207","v":"N (gew%)"},null,9.9999999999999995E-7,4.0000000000000003E-5,0]
[null,{"$f":"language!A208","v":"S (gew%)"},null,1.8E-3,3.3300000000000003E-2,1.6999999999999999E-3]
[null,{"$f":"language!A209","v":"As (gew%)"}]
[null,{"$f":"B24","v":"C (gew%)"},null,{"$f":"IF($A1=1,IF(SUM(D$19:D$28)=0,\"\",IF(SUM(D$24:D$28)=0,D19*12/1000,D24)),\"\")","v":0.86199999999999999},{"$f":"IF($A1=1,IF(SUM(E$19:E$28)=0,\"\",IF(SUM(E$24:E$28)=0,E19*12/1000,E24)),\"\")","v":0.85580000000000001},{"$f":"IF($A1=1,IF(SUM(F$19:F$28)=0,\"\",IF(SUM(F$24:F$28)=0,F19*12/1000,F24)),\"\")","v":0.86319999999999997},{"$f":"IF($A1=1,IF(SUM(G$19:G$28)=0,\"\",IF(SUM(G$24:G$28)=0,G19*12/1000,G24)),\"\")","v":""},{"$f":"IF($A1=1,IF(SUM(H$19:H$28)=0,\"\",IF(SUM(H$24:H$28)=0,H19*12/1000,H24)),\"\")","v":""}]
[null,{"$f":"B25","v":"H (gew%)"},null,{"$f":"IF($A1=1,IF(SUM(D$19:D$28)=0,\"\",IF(SUM(D$24:D$28)=0,D20/1000,D25)),\"\")","v":0.13100000000000001},{"$f":"IF($A1=1,IF(SUM(E$19:E$28)=0,\"\",IF(SUM(E$24:E$28)=0,E20/1000,E25)),\"\")","v":0.1046},{"$f":"IF($A1=1,IF(SUM(F$19:F$28)=0,\"\",IF(SUM(F$24:F$28)=0,F20/1000,F25)),\"\")","v":0.13370000000000001},{"$f":"IF($A1=1,IF(SUM(G$19:G$28)=0,\"\",IF(SUM(G$24:G$28)=0,G20/1000,G25)),\"\")","v":""},{"$f":"IF($A1=1,IF(SUM(H$19:H$28)=0,\"\",IF(SUM(H$24:H$28)=0,H20/1000,H25)),\"\")","v":""}]
[null,{"$f":"B26","v":"N (gew%)"},null,{"$f":"IF($A1=1,IF(SUM(D$19:D$28)=0,\"\",IF(SUM(D$24:D$28)=0,D21*14/1000,D26)),\"\")","v":9.9999999999999995E-7},{"$f":"IF($A1=1,IF(SUM(E$19:E$28)=0,\"\",IF(SUM(E$24:E$28)=0,E21*14/1000,E26)),\"\")","v":4.0000000000000003E-5},{"$f":"IF($A1=1,IF(SUM(F$19:F$28)=0,\"\",IF(SUM(F$24:F$28)=0,F21*14/1000,F26)),\"\")","v":0},{"$f":"IF($A1=1,IF(SUM(G$19:G$28)=0,\"\",IF(SUM(G$24:G$28)=0,G21*14/1000,G26)),\"\")","v":""},{"$f":"IF($A1=1,IF(SUM(H$19:H$28)=0,\"\",IF(SUM(H$24:H$28)=0,H21*14/1000,H26)),\"\")","v":""}]
[null,{"$f":"B27","v":"S (gew%)"},null,{"$f":"IF($A1=1,IF(SUM(D$19:D$28)=0,\"\",IF(SUM(D$24:D$28)=0,D22*32/1000,D27)),\"\")","v":1.8E-3},{"$f":"IF($A1=1,IF(SUM(E$19:E$28)=0,\"\",IF(SUM(E$24:E$28)=0,E22*32/1000,E27)),\"\")","v":3.3300000000000003E-2},{"$f":"IF($A1=1,IF(SUM(F$19:F$28)=0,\"\",IF(SUM(F$24:F$28)=0,F22*32/1000,F27)),\"\")","v":1.6999999999999999E-3},{"$f":"IF($A1=1,IF(SUM(G$19:G$28)=0,\"\",IF(SUM(G$24:G$28)=0,G22*32/1000,G27)),\"\")","v":""},{"$f":"IF($A1=1,IF(SUM(H$19:H$28)=0,\"\",IF(SUM(H$24:H$28)=0,H22*32/1000,H27)),\"\")","v":""}]
[null,{"$f":"B28","v":"As (gew%)"},null,{"$f":"IF($A1=1,IF(SUM(D$19:D$28)=0,\"\",IF(SUM(D$24:D$28)=0,\"\",IF(D28=\"\",\"\",D28))),\"\")","v":""},{"$f":"IF($A1=1,IF(SUM(E$19:E$28)=0,\"\",IF(SUM(E$24:E$28)=0,\"\",IF(E28=\"\",\"\",E28))),\"\")","v":""},{"$f":"IF($A1=1,IF(SUM(F$19:F$28)=0,\"\",IF(SUM(F$24:F$28)=0,\"\",IF(F28=\"\",\"\",F28))),\"\")","v":""},{"$f":"IF($A1=1,IF(SUM(G$19:G$28)=0,\"\",IF(SUM(G$24:G$28)=0,\"\",IF(G28=\"\",\"\",G28))),\"\")","v":""},{"$f":"IF($A1=1,IF(SUM(H$19:H$28)=0,\"\",IF(SUM(H$24:H$28)=0,\"\",IF(H28=\"\",\"\",H28))),\"\")","v":""}]
[null,{"$f":"language!A210","v":"O (gew%)"},null,{"$f":"IF($A1=1,IF(SUM(D19:D28)=0,\"\",IF(SUM(D24:D28)=0,D23*16/1000,1-SUM(D29:D33))),\"\")","v":5.1989999999999537E-3},{"$f":"IF($A1=1,IF(SUM(E19:E28)=0,\"\",IF(SUM(E24:E28)=0,E23*16/1000,1-SUM(E29:E33))),\"\")","v":6.2599999999999323E-3},{"$f":"IF($A1=1,IF(SUM(F19:F28)=0,\"\",IF(SUM(F24:F28)=0,F23*16/1000,1-SUM(F29:F33))),\"\")","v":1.3999999999999568E-3},{"$f":"IF($A1=1,IF(SUM(G19:G28)=0,\"\",IF(SUM(G24:G28)=0,G23*16/1000,1-SUM(G29:G33))),\"\")","v":""},{"$f":"IF($A1=1,IF(SUM(H19:H28)=0,\"\",IF(SUM(H24:H28)=0,H23*16/1000,1-SUM(H29:H33))),\"\")","v":""}]
[null,{"$f":"'Gaseous fuels'!B74","v":"Stoichiometrisch verbranding"}]
[null,{"$f":"language!A197","v":"Zuurstofverbruik"},{"$f":"language!A75","v":"mol/kg"},{"$f":"IF(SUM(D29:D33)=0,\"\",(D29/12.011+D30/1.0079/4-D34/15.9994/2+D32/32.06)*1000)","v":104.15451920864717},{"$f":"IF(SUM(E29:E33)=0,\"\",(E29/12.011+E30/1.0079/4-E34/15.9994/2+E32/32.06)*1000)","v":98.03943229958324},{"$f":"IF(SUM(F29:F33)=0,\"\",(F29/12.011+F30/1.0079/4-F34/15.9994/2+F32/32.06)*1000)","v":105.03974097301786},{"$f":"IF(SUM(G29:G33)=0,\"\",(G29/12.011+G30/1.0079/4-G34/15.9994/2+G32/32.06)*1000)","v":""},{"$f":"IF(SUM(H29:H33)=0,\"\",(H29/12.011+H30/1.0079/4-H34/15.9994/2+H32/32.06)*1000)","v":""}]
[null,{"$f":"'Gaseous fuels'!B76","v":"Koolstofdioxide"},{"$f":"C18","v":"Nm3/kg"},{"$f":"IF(SUM(D29:D33)=0,\"\",(D29/12.011)*'Gaseous fuels'!$L$29)","v":1.5965480143202064},{"$f":"IF(SUM(E29:E33)=0,\"\",(E29/12.011)*'Gaseous fuels'!$L$29)","v":1.5850647223378569},{"$f":"IF(SUM(F29:F33)=0,\"\",(F29/12.011)*'Gaseous fuels'!$L$29)","v":1.5987705869619515},{"$f":"IF(SUM(G29:G33)=0,\"\",(G29/12.011)*'Gaseous fuels'!$L$29)","v":""},{"$f":"IF(SUM(H29:H33)=0,\"\",(H29/12.011)*'Gaseous fuels'!$L$29)","v":""}]
[null,{"$f":"'Gaseous fuels'!B77","v":"Waterdamp"},{"$f":"C37","v":"Nm3/kg"},{"$f":"IF(SUM(D29:D33)=0,\"\",(D30/1.0079/2)*'Gaseous fuels'!$L$24)","v":1.4055952971524954},{"$f":"IF(SUM(E29:E33)=0,\"\",(E30/1.0079/2)*'Gaseous fuels'!$L$24)","v":1.1223302907034429},{"$f":"IF(SUM(F29:F33)=0,\"\",(F30/1.0079/2)*'Gaseous fuels'!$L$24)","v":1.4345655819029668},{"$f":"IF(SUM(G29:G33)=0,\"\",(G30/1.0079/2)*'Gaseous fuels'!$L$24)","v":""},{"$f":"IF(SUM(H29:H33)=0,\"\",(H30/1.0079/2)*'Gaseous fuels'!$L$24)","v":""}]
[null,{"$f":"'Gaseous fuels'!B78","v":"Brandstofstikstof"},"Nm3/kg",{"$f":"IF(SUM(D29:D33)=0,\"\",(D31/14.0067/2)*'Gaseous fuels'!$L$25)","v":7.9974940564158575E-7},{"$f":"IF(SUM(E29:E33)=0,\"\",(E31/14.0067/2)*'Gaseous fuels'!$L$25)","v":3.1989976225663439E-5},{"$f":"IF(SUM(F29:F33)=0,\"\",(F31/14.0067/2)*'Gaseous fuels'!$L$25)","v":0},{"$f":"IF(SUM(G29:G33)=0,\"\",(G31/14.0067/2)*'Gaseous fuels'!$L$25)","v":""},{"$f":"IF(SUM(H29:H33)=0,\"\",(H31/14.0067/2)*'Gaseous fuels'!$L$25)","v":""}]
[null,{"$f":"'Gaseous fuels'!B79","v":"Zwaveldioxide"},"Nm3/kg",{"$f":"IF(SUM(D29:D33)=0,\"\",(D32/32.06)*22.4)","v":1.2576419213973797E-3},{"$f":"IF(SUM(E29:E33)=0,\"\",(E32/32.06)*22.4)","v":2.326637554585153E-2},{"$f":"IF(SUM(F29:F33)=0,\"\",(F32/32.06)*22.4)","v":1.1877729257641918E-3},{"$f":"IF(SUM(G29:G33)=0,\"\",(G32/32.06)*22.4)","v":""},{"$f":"IF(SUM(H29:H33)=0,\"\",(H32/32.06)*22.4)","v":""}]
[null,{"$f":"'Gaseous fuels'!B80","v":"Droog luchtverbruik"},"Nm3/kg",{"$f":"IF(SUM(D29:D33)=0,\"\",D36/0.2095*22.4003/1000)","v":11.136479602049928},{"$f":"IF(SUM(E29:E33)=0,\"\",E36/0.2095*22.4003/1000)","v":10.482638163915775},{"$f":"IF(SUM(F29:F33)=0,\"\",F36/0.2095*22.4003/1000)","v":11.231129879321681},{"$f":"IF(SUM(G29:G33)=0,\"\",G36/0.2095*22.4003/1000)","v":""},{"$f":"IF(SUM(H29:H33)=0,\"\",H36/0.2095*22.4003/1000)","v":""}]
[null,{"$f":"'Gaseous fuels'!B81","v":"Rookgasdebiet (droog)"},"Nm3/kg",{"$f":"IF(SUM(D29:D33)=0,\"\",D41*(1-0.2095)+D37+D39+D40)","v":10.401193581411476},{"$f":"IF(SUM(E29:E33)=0,\"\",E41*(1-0.2095)+E37+E39+E40)","v":9.8948885564353528},{"$f":"IF(SUM(F29:F33)=0,\"\",F41*(1-0.2095)+F37+F39+F40)","v":10.478166529491505},{"$f":"IF(SUM(G29:G33)=0,\"\",G41*(1-0.2095)+G37+G39+G40)","v":""},{"$f":"IF(SUM(H29:H33)=0,\"\",H41*(1-0.2095)+H37+H39+H40)","v":""}]
[null,{"$f":"'Gaseous fuels'!B82","v":"Rookgasdebiet (nat)"},"Nm3/kg",{"$f":"IF(SUM(D29:D33)=0,\"\",D42+D38)","v":11.806788878563971},{"$f":"IF(SUM(E29:E33)=0,\"\",E42+E38)","v":11.017218847138796},{"$f":"IF(SUM(F29:F33)=0,\"\",F42+F38)","v":11.912732111394472},{"$f":"IF(SUM(G29:G33)=0,\"\",G42+G38)","v":""},{"$f":"IF(SUM(H29:H33)=0,\"\",H42+H38)","v":""}]
[null,{"$f":"'Gaseous fuels'!B83","v":"DIN1942"}]
[null,{"$f":"'Gaseous fuels'!B84","v":"Koolstofdioxide"},{"$f":"C43","v":"Nm3/kg"},{"$f":"IF(D5=\"\",\"\",1.191+0.009342*D5)","v":1.5878481600000001},{"$f":"IF(E5=\"\",\"\",1.191+0.009342*E5)","v":1.5668286600000001},{"$f":"IF(F5=\"\",\"\",1.191+0.009342*F5)","v":1.5894363},{"$f":"IF(G5=\"\",\"\",1.191+0.009342*G5)","v":1.574022},{"$f":"IF(H5=\"\",\"\",1.191+0.009342*H5)","v":1.6113900000000001}]
[null,{"$f":"'Gaseous fuels'!B85","v":"Waterdamp"},{"$f":"C45","v":"Nm3/kg"},{"$f":"IF(D5=\"\",\"\",-2.4082+0.0918*D5)","v":1.4914640000000001},{"$f":"IF(E5=\"\",\"\",-2.4082+0.0918*E5)","v":1.2849140000000001},{"$f":"IF(F5=\"\",\"\",-2.4082+0.0918*F5)","v":1.5070700000000001},{"$f":"IF(G5=\"\",\"\",-2.4082+0.0918*G5)","v":1.3556000000000004},{"$f":"IF(H5=\"\",\"\",-2.4082+0.0918*H5)","v":1.7228000000000003}]
[null,{"$f":"'Gaseous fuels'!B86","v":"Brandstofstikstof"},"Nm3/kg",{"$f":"IF(D5=\"\",\"\",0)","v":0},{"$f":"IF(E5=\"\",\"\",0)","v":0},{"$f":"IF(F5=\"\",\"\",0)","v":0},{"$f":"IF(G5=\"\",\"\",0)","v":0},{"$f":"IF(H5=\"\",\"\",0)","v":0}]
[null,{"$f":"'Gaseous fuels'!B87","v":"Zwaveldioxide"},"Nm3/kg",{"$f":"IF(D5=\"\",\"\",IF(D40=\"\",0,D40))","v":1.2576419213973797E-3},{"$f":"IF(E5=\"\",\"\",IF(E40=\"\",0,E40))","v":2.326637554585153E-2},{"$f":"IF(F5=\"\",\"\",IF(F40=\"\",0,F40))","v":1.1877729257641918E-3},{"$f":"IF(G5=\"\",\"\",IF(G40=\"\",0,G40))","v":0},{"$f":"IF(H5=\"\",\"\",IF(H40=\"\",0,H40))","v":0}]
[null,{"$f":"'Gaseous fuels'!B88","v":"Droog luchtverbruik"},"Nm3/kg",{"$f":"IF(D5=\"\",\"\",-0.3311+0.2675*D5)","v":11.032300000000001},{"$f":"IF(E5=\"\",\"\",-0.3311+0.2675*E5)","v":10.430425000000001},{"$f":"IF(F5=\"\",\"\",-0.3311+0.2675*F5)","v":11.077775000000001},{"$f":"IF(G5=\"\",\"\",-0.3311+0.2675*G5)","v":10.636400000000002},{"$f":"IF(H5=\"\",\"\",-0.3311+0.2675*H5)","v":11.706400000000002}]
[null,{"$f":"'Gaseous fuels'!B89","v":"Rookgasdebiet (droog)"},"Nm3/kg",{"$f":"IF(D5=\"\",\"\",0.929+0.2208*D5)","v":10.308584},{"$f":"IF(E5=\"\",\"\",0.929+0.2208*E5)","v":9.8117839999999994},{"$f":"IF(F5=\"\",\"\",0.929+0.2208*F5)","v":10.346119999999999},{"$f":"IF(G5=\"\",\"\",0.929+0.2208*G5)","v":9.9817999999999998},{"$f":"IF(H5=\"\",\"\",0.929+0.2208*H5)","v":10.865}]
[null,{"$f":"'Gaseous fuels'!B90","v":"Rookgasdebiet (nat)"},"Nm3/kg",{"$f":"IF(D5=\"\",\"\",-1.4792+0.3126*D5)","v":11.800047999999999},{"$f":"IF(E5=\"\",\"\",-1.4792+0.3126*E5)","v":11.096697999999998},{"$f":"IF(F5=\"\",\"\",-1.4792+0.3126*F5)","v":11.853189999999998},{"$f":"IF(G5=\"\",\"\",-1.4792+0.3126*G5)","v":11.337399999999999},{"$f":"IF(H5=\"\",\"\",-1.4792+0.3126*H5)","v":12.5878}]

{"sheet":"Solid fuels","index":5,"n_rows":53,"n_cols":8,"rows_kept":53,"cut":false,"hidden":false,"merged":[]}
[{"$f":"IF(NOW()>Data!B2,0,1)","v":1}]
[null,null,{"$f":"'Liquid fuels'!C2","v":"Omschrijving"},{"$f":"language!A32","v":"KOLEN"},"SF 1","SF 2","SF 3","SF 4"]
[null,{"$f":"'Liquid fuels'!B3","v":"Onderste verbrandingswaarde"},{"$f":"'Liquid fuels'!C3","v":"kJ/kg"},25870,10000,15000,20000,25000]
[null,{"$f":"'Liquid fuels'!B4","v":"Gehalte fossiele brandstof"},{"$f":"'Liquid fuels'!C4","v":"%"},100,100,50,100,100]
[null,{"$f":"'Liquid fuels'!B5","v":"Onderste verbrandingswaarde"},{"$f":"'Liquid fuels'!C5","v":"MJ/kg"},{"$f":"IF($A1=1,IF(D3=\"\",\"\",D3/1000),\"\")","v":25.87},{"$f":"IF($A1=1,IF(E3=\"\",\"\",E3/1000),\"\")","v":10},{"$f":"IF($A1=1,IF(F3=\"\",\"\",F3/1000),\"\")","v":15},{"$f":"IF($A1=1,IF(G3=\"\",\"\",G3/1000),\"\")","v":20},{"$f":"IF($A1=1,IF(H3=\"\",\"\",H3/1000),\"\")","v":25}]
[null,{"$f":"'Liquid fuels'!B6","v":"Bovenste verbrandingswaarde"},{"$f":"'Liquid fuels'!C6","v":"MJ/kg"},{"$f":"IF(D5=\"\",\"\",D5+(D18-D17)*44.0136/21.629)","v":27.012400320696798},{"$f":"IF(E5=\"\",\"\",E5+(E18-E17)*44.0136/21.629)","v":11.891675184243375},{"$f":"IF(F5=\"\",\"\",F5+(F18-F17)*44.0136/21.629)","v":16.722775614221646},{"$f":"IF(G5=\"\",\"\",G5+(G18-G17)*44.0136/21.629)","v":21.553876044199917},{"$f":"IF(H5=\"\",\"\",H5+(H18-H17)*44.0136/21.629)","v":26.384976474178188}]
[null,{"$f":"'Liquid fuels'!B7","v":"Wobbe-index"},{"$f":"'Liquid fuels'!C7","v":"MJ/kg"}]
[null,{"$f":"'Liquid fuels'!B8","v":"Berekeningsmethode"},null,{"$f":"IF($A1=1,IF(OR(D30=0,D30=\"\"),IF(D3=\"\",\"\",language!$A$198),language!$A$199),\"\")","v":"samenstelling"},{"$f":"IF($A1=1,IF(OR(E30=0,E30=\"\"),IF(E3=\"\",\"\",language!$A$198),language!$A$199),\"\")","v":"DIN1942"},{"$f":"IF($A1=1,IF(OR(F30=0,F30=\"\"),IF(F3=\"\",\"\",language!$A$198),language!$A$199),\"\")","v":"DIN1942"},{"$f":"IF($A1=1,IF(OR(G30=0,G30=\"\"),IF(G3=\"\",\"\",language!$A$198),language!$A$199),\"\")","v":"DIN1942"},{"$f":"IF($A1=1,IF(OR(H30=0,H30=\"\"),IF(H3=\"\",\"\",language!$A$198),language!$A$199),\"\")","v":"DIN1942"}]
[null,{"$f":"'Liquid fuels'!B9","v":"Koolstofdioxide"},{"$f":"'Liquid fuels'!C9","v":"Nm3/kg"},{"$f":"IF(D$8=\"\",\"\",IF(D$8=language!$A$198,D47,D39))","v":1.2547978363500125},{"$f":"IF(E$8=\"\",\"\",IF(E$8=language!$A$198,E47,E39))","v":0.54159999999999997},{"$f":"IF(F$8=\"\",\"\",IF(F$8=language!$A$198,F47,F39))","v":0.76159999999999994},{"$f":"IF(G$8=\"\",\"\",IF(G$8=language!$A$198,G47,G39))","v":0.98159999999999992},{"$f":"IF(H$8=\"\",\"\",IF(H$8=language!$A$198,H47,H39))","v":1.2015999999999998}]
[null,null,{"$f":"'Liquid fuels'!C10","v":"kg/GJ"},{"$f":"IF(OR(D9=\"\",D5=\"\"),\"\",D9/'Gaseous fuels'!$L$29*'Gaseous fuels'!$K$29*1000/D5)","v":95.956156100561984},{"$f":"IF(OR(E9=\"\",E5=\"\"),\"\",E9/'Gaseous fuels'!$L$29*'Gaseous fuels'!$K$29*1000/E5)","v":107.1455566593695},{"$f":"IF(OR(F9=\"\",F5=\"\"),\"\",F9/'Gaseous fuels'!$L$29*'Gaseous fuels'!$K$29*1000/F5)","v":100.4456621759919},{"$f":"IF(OR(G9=\"\",G5=\"\"),\"\",G9/'Gaseous fuels'!$L$29*'Gaseous fuels'!$K$29*1000/G5)","v":97.095714934303089},{"$f":"IF(OR(H9=\"\",H5=\"\"),\"\",H9/'Gaseous fuels'!$L$29*'Gaseous fuels'!$K$29*1000/H5)","v":95.085746589289798}]
[null,{"$f":"'Liquid fuels'!B11","v":"Waterdamp"},{"$f":"'Liquid fuels'!C11","v":"Nm3/kg"},{"$f":"IF(D$8=\"\",\"\",IF(D$8=language!$A$198,D48,D40))","v":0.56139412673244304},{"$f":"IF(E$8=\"\",\"\",IF(E$8=language!$A$198,E48,E40))","v":0.93},{"$f":"IF(F$8=\"\",\"\",IF(F$8=language!$A$198,F48,F40))","v":0.84700000000000009},{"$f":"IF(G$8=\"\",\"\",IF(G$8=language!$A$198,G48,G40))","v":0.76400000000000001},{"$f":"IF(H$8=\"\",\"\",IF(H$8=language!$A$198,H48,H40))","v":0.68100000000000005}]
[null,{"$f":"'Liquid fuels'!B12","v":"Brandstofstikstof"},{"$f":"'Liquid fuels'!C12","v":"Nm3/kg"},{"$f":"IF(D$8=\"\",\"\",IF(D$8=language!$A$198,D49,D41))","v":1.1012549315684636E-2},{"$f":"IF(E$8=\"\",\"\",IF(E$8=language!$A$198,E49,E41))","v":0},{"$f":"IF(F$8=\"\",\"\",IF(F$8=language!$A$198,F49,F41))","v":0},{"$f":"IF(G$8=\"\",\"\",IF(G$8=language!$A$198,G49,G41))","v":0},{"$f":"IF(H$8=\"\",\"\",IF(H$8=language!$A$198,H49,H41))","v":0}]
[null,{"$f":"'Liquid fuels'!B13","v":"Zwaveldioxide"},{"$f":"'Liquid fuels'!C13","v":"Nm3/kg"},{"$f":"IF(D$8=\"\",\"\",IF(D$8=language!$A$198,D50,D42))","v":6.4139737991266372E-3},{"$f":"IF(E$8=\"\",\"\",IF(E$8=language!$A$198,E50,E42))","v":0},{"$f":"IF(F$8=\"\",\"\",IF(F$8=language!$A$198,F50,F42))","v":0},{"$f":"IF(G$8=\"\",\"\",IF(G$8=language!$A$198,G50,G42))","v":0},{"$f":"IF(H$8=\"\",\"\",IF(H$8=language!$A$198,H50,H42))","v":0}]
[null,null,{"$f":"'Liquid fuels'!C14","v":"kg/GJ"},{"$f":"IF(D8=\"\",\"\",D13/22.4*64*1000/D5)","v":0.70837415640031332},{"$f":"IF(E8=\"\",\"\",E13/22.4*64*1000/E5)","v":0},{"$f":"IF(F8=\"\",\"\",F13/22.4*64*1000/F5)","v":0},{"$f":"IF(G8=\"\",\"\",G13/22.4*64*1000/G5)","v":0},{"$f":"IF(H8=\"\",\"\",H13/22.4*64*1000/H5)","v":0}]
[null,{"$f":"'Liquid fuels'!B15","v":"Stoichiometrisch luchtverbruik"},{"$f":"'Liquid fuels'!C15","v":"Nm3/kg"},{"$f":"IF(D8=\"\",\"\",IF(D8=language!$A$198,D51,D43))","v":6.9942478693381442},{"$f":"IF(E8=\"\",\"\",IF(E8=language!$A$198,E51,E43))","v":2.9028},{"$f":"IF(F8=\"\",\"\",IF(F8=language!$A$198,F51,F43))","v":4.1337999999999999},{"$f":"IF(G8=\"\",\"\",IF(G8=language!$A$198,G51,G43))","v":5.3648000000000007},{"$f":"IF(H8=\"\",\"\",IF(H8=language!$A$198,H51,H43))","v":6.5958000000000006}]
[null,{"$f":"'Liquid fuels'!B16","v":"Stoichiometrisch rookgasvolume"}]
[null,{"$f":"'Liquid fuels'!B17","v":"  droog"},{"$f":"'Liquid fuels'!C17","v":"Nm3/kg"},{"$f":"IF(D8=\"\",\"\",IF(D8=language!$A$198,D52,D44))","v":6.8011773001766267},{"$f":"IF(E8=\"\",\"\",IF(E8=language!$A$198,E52,E44))","v":2.8360000000000003},{"$f":"IF(F8=\"\",\"\",IF(F8=language!$A$198,F52,F44))","v":4.0289999999999999},{"$f":"IF(G8=\"\",\"\",IF(G8=language!$A$198,G52,G44))","v":5.2220000000000004},{"$f":"IF(H8=\"\",\"\",IF(H8=language!$A$198,H52,H44))","v":6.415}]
[null,{"$f":"'Liquid fuels'!B18","v":"  nat"},{"$f":"'Liquid fuels'!C18","v":"Nm3/kg"},{"$f":"IF(D8=\"\",\"\",IF(D8=language!$A$198,D53,D45))","v":7.3625714269090698},{"$f":"IF(E8=\"\",\"\",IF(E8=language!$A$198,E53,E45))","v":3.7656000000000001},{"$f":"IF(F8=\"\",\"\",IF(F8=language!$A$198,F53,F45))","v":4.8756000000000004},{"$f":"IF(G8=\"\",\"\",IF(G8=language!$A$198,G53,G45))","v":5.9856000000000007},{"$f":"IF(H8=\"\",\"\",IF(H8=language!$A$198,H53,H45))","v":7.0956000000000001}]
[null,{"$f":"'Liquid fuels'!B19","v":"mol C/kg"}]
[null,{"$f":"'Liquid fuels'!B20","v":"mol H/kg"}]
[null,{"$f":"'Liquid fuels'!B21","v":"mol N/kg"}]
[null,{"$f":"'Liquid fuels'!B22","v":"mol S/kg"}]
[null,{"$f":"'Liquid fuels'!B23","v":"mol O/kg"}]
[null,{"$f":"language!A211","v":"C (gew%,droog)"},null,0.73799999999999999]
[null,{"$f":"language!A212","v":"H (gew%,droog)"},null,4.7E-2]
[null,{"$f":"language!A213","v":"N (gew%,droog)"},null,1.4999999999999999E-2]
[null,{"$f":"language!A214","v":"S (gew%,droog)"},null,0.01]
[null,{"$f":"language!A215","v":"O (gew% droog)"},null,6.9000000000000006E-2]
[null,{"$f":"language!A218","v":"Vochtgehalte"},null,8.2000000000000003E-2]
[null,{"$f":"B24","v":"C (gew%,droog)"},null,{"$f":"IF($A1=1,IF(SUM(D19:D29)=0,\"\",IF(SUM(D24:D29)=0,D19*12/1000,D24)),\"\")","v":0.73799999999999999},{"$f":"IF($A1=1,IF(SUM(E19:E29)=0,\"\",IF(SUM(E24:E29)=0,E19*12/1000,E24)),\"\")","v":""},{"$f":"IF($A1=1,IF(SUM(F19:F29)=0,\"\",IF(SUM(F24:F29)=0,F19*12/1000,F24)),\"\")","v":""},{"$f":"IF($A1=1,IF(SUM(G19:G29)=0,\"\",IF(SUM(G24:G29)=0,G19*12/1000,G24)),\"\")","v":""},{"$f":"IF($A1=1,IF(SUM(H19:H29)=0,\"\",IF(SUM(H24:H29)=0,H19*12/1000,H24)),\"\")","v":""}]
[null,"H (gew%,droog)",null,{"$f":"IF($A1=1,IF(SUM(D19:D29)=0,\"\",IF(SUM(D24:D29)=0,D20/1000,D25)),\"\")","v":4.7E-2},{"$f":"IF($A1=1,IF(SUM(E19:E29)=0,\"\",IF(SUM(E24:E29)=0,E20/1000,E25)),\"\")","v":""},{"$f":"IF($A1=1,IF(SUM(F19:F29)=0,\"\",IF(SUM(F24:F29)=0,F20/1000,F25)),\"\")","v":""},{"$f":"IF($A1=1,IF(SUM(G19:G29)=0,\"\",IF(SUM(G24:G29)=0,G20/1000,G25)),\"\")","v":""},{"$f":"IF($A1=1,IF(SUM(H19:H29)=0,\"\",IF(SUM(H24:H29)=0,H20/1000,H25)),\"\")","v":""}]
[null,"N (gew%,droog)",null,{"$f":"IF($A1=1,IF(SUM(D19:D29)=0,\"\",IF(SUM(D24:D29)=0,D21*14/1000,D26)),\"\")","v":1.4999999999999999E-2},{"$f":"IF($A1=1,IF(SUM(E19:E29)=0,\"\",IF(SUM(E24:E29)=0,E21*14/1000,E26)),\"\")","v":""},{"$f":"IF($A1=1,IF(SUM(F19:F29)=0,\"\",IF(SUM(F24:F29)=0,F21*14/1000,F26)),\"\")","v":""},{"$f":"IF($A1=1,IF(SUM(G19:G29)=0,\"\",IF(SUM(G24:G29)=0,G21*14/1000,G26)),\"\")","v":""},{"$f":"IF($A1=1,IF(SUM(H19:H29)=0,\"\",IF(SUM(H24:H29)=0,H21*14/1000,H26)),\"\")","v":""}]
[null,"S (gew%,droog)",null,{"$f":"IF($A1=1,IF(SUM(D19:D29)=0,\"\",IF(SUM(D24:D29)=0,D22*32/1000,D27)),\"\")","v":0.01},{"$f":"IF($A1=1,IF(SUM(E19:E29)=0,\"\",IF(SUM(E24:E29)=0,E22*32/1000,E27)),\"\")","v":""},{"$f":"IF($A1=1,IF(SUM(F19:F29)=0,\"\",IF(SUM(F24:F29)=0,F22*32/1000,F27)),\"\")","v":""},{"$f":"IF($A1=1,IF(SUM(G19:G29)=0,\"\",IF(SUM(G24:G29)=0,G22*32/1000,G27)),\"\")","v":""},{"$f":"IF($A1=1,IF(SUM(H19:H29)=0,\"\",IF(SUM(H24:H29)=0,H22*32/1000,H27)),\"\")","v":""}]
[null,"O (gew% droog)",null,{"$f":"IF($A1=1,IF(SUM(D19:D29)=0,\"\",IF(SUM(D24:D29)=0,D23*16/1000,D28)),\"\")","v":6.9000000000000006E-2},{"$f":"IF($A1=1,IF(SUM(E19:E29)=0,\"\",IF(SUM(E24:E29)=0,E23*16/1000,E28)),\"\")","v":""},{"$f":"IF($A1=1,IF(SUM(F19:F29)=0,\"\",IF(SUM(F24:F29)=0,F23*16/1000,F28)),\"\")","v":""},{"$f":"IF($A1=1,IF(SUM(G19:G29)=0,\"\",IF(SUM(G24:G29)=0,G23*16/1000,G28)),\"\")","v":""},{"$f":"IF($A1=1,IF(SUM(H19:H29)=0,\"\",IF(SUM(H24:H29)=0,H23*16/1000,H28)),\"\")","v":""}]
[null,"Vochtgehalte",null,{"$f":"IF($A1=1,IF(D34=\"\",\"\",IF(SUM(D24:D29)=0,0,D29)),\"\")","v":8.2000000000000003E-2},{"$f":"IF($A1=1,IF(E34=\"\",\"\",IF(SUM(E24:E29)=0,0,E29)),\"\")","v":""},{"$f":"IF($A1=1,IF(F34=\"\",\"\",IF(SUM(F24:F29)=0,0,F29)),\"\")","v":""},{"$f":"IF($A1=1,IF(G34=\"\",\"\",IF(SUM(G24:G29)=0,0,G29)),\"\")","v":""},{"$f":"IF($A1=1,IF(H34=\"\",\"\",IF(SUM(H24:H29)=0,0,H29)),\"\")","v":""}]
[null,{"$f":"language!A216","v":"As (gew% droog)"},null,{"$f":"IF($A1=1,IF(SUM(D19:D29)=0,\"\",1-D34-D33-D32-D31-D30),\"\")","v":0.121},{"$f":"IF($A1=1,IF(SUM(E19:E29)=0,\"\",1-E34-E33-E32-E31-E30),\"\")","v":""},{"$f":"IF($A1=1,IF(SUM(F19:F29)=0,\"\",1-F34-F33-F32-F31-F30),\"\")","v":""},{"$f":"IF($A1=1,IF(SUM(G19:G29)=0,\"\",1-G34-G33-G32-G31-G30),\"\")","v":""},{"$f":"IF($A1=1,IF(SUM(H19:H29)=0,\"\",1-H34-H33-H32-H31-H30),\"\")","v":""}]
[null,{"$f":"'Liquid fuels'!B35","v":"Stoichiometrisch verbranding"}]
[null,{"$f":"'Liquid fuels'!B36","v":"Zuurstofverbruik"},{"$f":"'Liquid fuels'!C36","v":"mol/kg"},{"$f":"IF(D36=\"\",\"\",(D30/12.011+D31/1.0079/4-D34/15.9994/2+D33/32.06)*1000*(1-D35))","v":65.414076089442602},{"$f":"IF(E36=\"\",\"\",(E30/12.011+E31/1.0079/4-E34/15.9994/2+E33/32.06)*1000*(1-E35))","v":""},{"$f":"IF(F36=\"\",\"\",(F30/12.011+F31/1.0079/4-F34/15.9994/2+F33/32.06)*1000*(1-F35))","v":""},{"$f":"IF(G36=\"\",\"\",(G30/12.011+G31/1.0079/4-G34/15.9994/2+G33/32.06)*1000*(1-G35))","v":""},{"$f":"IF(H36=\"\",\"\",(H30/12.011+H31/1.0079/4-H34/15.9994/2+H33/32.06)*1000*(1-H35))","v":""}]
[null,{"$f":"'Liquid fuels'!B37","v":"Koolstofdioxide"},{"$f":"'Liquid fuels'!C37","v":"Nm3/kg"},{"$f":"IF(D36=\"\",\"\",(D30/12.011)*'Gaseous fuels'!$L$29*(1-D35))","v":1.2547978363500125},{"$f":"IF(E36=\"\",\"\",(E30/12.011)*'Gaseous fuels'!$L$29*(1-E35))","v":""},{"$f":"IF(F36=\"\",\"\",(F30/12.011)*'Gaseous fuels'!$L$29*(1-F35))","v":""},{"$f":"IF(G36=\"\",\"\",(G30/12.011)*'Gaseous fuels'!$L$29*(1-G35))","v":""},{"$f":"IF(H36=\"\",\"\",(H30/12.011)*'Gaseous fuels'!$L$29*(1-H35))","v":""}]
[null,{"$f":"'Liquid fuels'!B38","v":"Waterdamp"},{"$f":"'Liquid fuels'!C38","v":"Nm3/kg"},{"$f":"IF(D36=\"\",\"\",((D31/1.0079/2*(1-D35))+(D35/ 'Gaseous fuels'!$K$24))*'Gaseous fuels'!$L$24)","v":0.56139412673244304},{"$f":"IF(E36=\"\",\"\",((E31/1.0079/2*(1-E35))+(E35/ 'Gaseous fuels'!$K$24))*'Gaseous fuels'!$L$24)","v":""},{"$f":"IF(F36=\"\",\"\",((F31/1.0079/2*(1-F35))+(F35/ 'Gaseous fuels'!$K$24))*'Gaseous fuels'!$L$24)","v":""},{"$f":"IF(G36=\"\",\"\",((G31/1.0079/2*(1-G35))+(G35/ 'Gaseous fuels'!$K$24))*'Gaseous fuels'!$L$24)","v":""},{"$f":"IF(H36=\"\",\"\",((H31/1.0079/2*(1-H35))+(H35/ 'Gaseous fuels'!$K$24))*'Gaseous fuels'!$L$24)","v":""}]
[null,{"$f":"'Liquid fuels'!B39","v":"Brandstofstikstof"},{"$f":"'Liquid fuels'!C39","v":"Nm3/kg"},{"$f":"IF(D36=\"\",\"\",(D32/14.0067/2)*'Gaseous fuels'!$L$25*(1-D35))","v":1.1012549315684636E-2},{"$f":"IF(E36=\"\",\"\",(E32/14.0067/2)*'Gaseous fuels'!$L$25*(1-E35))","v":""},{"$f":"IF(F36=\"\",\"\",(F32/14.0067/2)*'Gaseous fuels'!$L$25*(1-F35))","v":""},{"$f":"IF(G36=\"\",\"\",(G32/14.0067/2)*'Gaseous fuels'!$L$25*(1-G35))","v":""},{"$f":"IF(H36=\"\",\"\",(H32/14.0067/2)*'Gaseous fuels'!$L$25*(1-H35))","v":""}]
[null,{"$f":"'Liquid fuels'!B40","v":"Zwaveldioxide"},{"$f":"'Liquid fuels'!C40","v":"Nm3/kg"},{"$f":"IF(D36=\"\",\"\",(D33/32.06)*22.4*(1-D35))","v":6.4139737991266372E-3},{"$f":"IF(E36=\"\",\"\",(E33/32.06)*22.4*(1-E35))","v":""},{"$f":"IF(F36=\"\",\"\",(F33/32.06)*22.4*(1-F35))","v":""},{"$f":"IF(G36=\"\",\"\",(G33/32.06)*22.4*(1-G35))","v":""},{"$f":"IF(H36=\"\",\"\",(H33/32.06)*22.4*(1-H35))","v":""}]
[null,{"$f":"'Liquid fuels'!B41","v":"Droog luchtverbruik"},{"$f":"'Liquid fuels'!C41","v":"Nm3/kg"},{"$f":"IF(D36=\"\",\"\",D38/0.2095*22.4003/1000)","v":6.9942478693381442},{"$f":"IF(E36=\"\",\"\",E38/0.2095*22.4003/1000)","v":""},{"$f":"IF(F36=\"\",\"\",F38/0.2095*22.4003/1000)","v":""},{"$f":"IF(G36=\"\",\"\",G38/0.2095*22.4003/1000)","v":""},{"$f":"IF(H36=\"\",\"\",H38/0.2095*22.4003/1000)","v":""}]
[null,{"$f":"'Liquid fuels'!B42","v":"Rookgasdebiet (droog)"},{"$f":"'Liquid fuels'!C42","v":"Nm3/kg"},{"$f":"IF(D36=\"\",\"\",D43*(1-0.2095)+D39+D41+D42)","v":6.8011773001766267},{"$f":"IF(E36=\"\",\"\",E43*(1-0.2095)+E39+E41+E42)","v":""},{"$f":"IF(F36=\"\",\"\",F43*(1-0.2095)+F39+F41+F42)","v":""},{"$f":"IF(G36=\"\",\"\",G43*(1-0.2095)+G39+G41+G42)","v":""},{"$f":"IF(H36=\"\",\"\",H43*(1-0.2095)+H39+H41+H42)","v":""}]
[null,{"$f":"'Liquid fuels'!B43","v":"Rookgasdebiet (nat)"},{"$f":"'Liquid fuels'!C43","v":"Nm3/kg"},{"$f":"IF(D36=\"\",\"\",D44+D40)","v":7.3625714269090698},{"$f":"IF(E36=\"\",\"\",E44+E40)","v":""},{"$f":"IF(F36=\"\",\"\",F44+F40)","v":""},{"$f":"IF(G36=\"\",\"\",G44+G40)","v":""},{"$f":"IF(H36=\"\",\"\",H44+H40)","v":""}]
[null,{"$f":"'Liquid fuels'!B44","v":"DIN1942"}]
[null,{"$f":"'Liquid fuels'!B45","v":"Koolstofdioxide"},{"$f":"'Liquid fuels'!C45","v":"Nm3/kg"},{"$f":"IF(D5=\"\",\"\",0.1016+0.044*D5)","v":1.2398799999999999},{"$f":"IF(E5=\"\",\"\",0.1016+0.044*E5)","v":0.54159999999999997},{"$f":"IF(F5=\"\",\"\",0.1016+0.044*F5)","v":0.76159999999999994},{"$f":"IF(G5=\"\",\"\",0.1016+0.044*G5)","v":0.98159999999999992},{"$f":"IF(H5=\"\",\"\",0.1016+0.044*H5)","v":1.2015999999999998}]
[null,{"$f":"'Liquid fuels'!B46","v":"Waterdamp"},{"$f":"'Liquid fuels'!C46","v":"Nm3/kg"},{"$f":"IF(D5=\"\",\"\",1.096-0.0166*D5)","v":0.66655799999999998},{"$f":"IF(E5=\"\",\"\",1.096-0.0166*E5)","v":0.93},{"$f":"IF(F5=\"\",\"\",1.096-0.0166*F5)","v":0.84700000000000009},{"$f":"IF(G5=\"\",\"\",1.096-0.0166*G5)","v":0.76400000000000001},{"$f":"IF(H5=\"\",\"\",1.096-0.0166*H5)","v":0.68100000000000005}]
[null,{"$f":"'Liquid fuels'!B47","v":"Brandstofstikstof"},{"$f":"'Liquid fuels'!C47","v":"Nm3/kg"},{"$f":"IF(D5=\"\",\"\",0)","v":0},{"$f":"IF(E5=\"\",\"\",0)","v":0},{"$f":"IF(F5=\"\",\"\",0)","v":0},{"$f":"IF(G5=\"\",\"\",0)","v":0},{"$f":"IF(H5=\"\",\"\",0)","v":0}]
[null,{"$f":"'Liquid fuels'!B48","v":"Zwaveldioxide"},{"$f":"'Liquid fuels'!C48","v":"Nm3/kg"},{"$f":"IF(D5=\"\",\"\",IF(D42=\"\",0,D42))","v":6.4139737991266372E-3},{"$f":"IF(E5=\"\",\"\",IF(E42=\"\",0,E42))","v":0},{"$f":"IF(F5=\"\",\"\",IF(F42=\"\",0,F42))","v":0},{"$f":"IF(G5=\"\",\"\",IF(G42=\"\",0,G42))","v":0},{"$f":"IF(H5=\"\",\"\",IF(H42=\"\",0,H42))","v":0}]
[null,{"$f":"'Liquid fuels'!B49","v":"Droog luchtverbruik"},{"$f":"'Liquid fuels'!C49","v":"Nm3/kg"},{"$f":"IF(D5=\"\",\"\",0.4408+0.2462*D5)","v":6.8099940000000005},{"$f":"IF(E5=\"\",\"\",0.4408+0.2462*E5)","v":2.9028},{"$f":"IF(F5=\"\",\"\",0.4408+0.2462*F5)","v":4.1337999999999999},{"$f":"IF(G5=\"\",\"\",0.4408+0.2462*G5)","v":5.3648000000000007},{"$f":"IF(H5=\"\",\"\",0.4408+0.2462*H5)","v":6.5958000000000006}]
[null,{"$f":"'Liquid fuels'!B50","v":"Rookgasdebiet (droog)"},{"$f":"'Liquid fuels'!C50","v":"Nm3/kg"},{"$f":"IF(D5=\"\",\"\",0.45+0.2386*D5)","v":6.6225820000000004},{"$f":"IF(E5=\"\",\"\",0.45+0.2386*E5)","v":2.8360000000000003},{"$f":"IF(F5=\"\",\"\",0.45+0.2386*F5)","v":4.0289999999999999},{"$f":"IF(G5=\"\",\"\",0.45+0.2386*G5)","v":5.2220000000000004},{"$f":"IF(H5=\"\",\"\",0.45+0.2386*H5)","v":6.415}]
[null,{"$f":"'Liquid fuels'!B51","v":"Rookgasdebiet (nat)"},{"$f":"'Liquid fuels'!C51","v":"Nm3/kg"},{"$f":"IF(D5=\"\",\"\",1.5456+0.222*D5)","v":7.2887400000000007},{"$f":"IF(E5=\"\",\"\",1.5456+0.222*E5)","v":3.7656000000000001},{"$f":"IF(F5=\"\",\"\",1.5456+0.222*F5)","v":4.8756000000000004},{"$f":"IF(G5=\"\",\"\",1.5456+0.222*G5)","v":5.9856000000000007},{"$f":"IF(H5=\"\",\"\",1.5456+0.222*H5)","v":7.0956000000000001}]

{"sheet":"Validation test","index":6,"n_rows":18,"n_cols":5,"rows_kept":18,"cut":false,"hidden":false,"merged":[[1,2,1,4]]}
[{"$f":"IF(NOW()>Data!B2,0,1)","v":1}]
[null,{"$f":"'Emission data'!B2","v":"Installatie/eenheid"},{"$f":"IF($A1=1,CONCATENATE(INDEX(Data!F5:F12,'Emission data'!E3),IF('Emission data'!E2=\"\",\"\",CONCATENATE(\" : \",'Emission data'!E2))),\"\")","v":"KETEL"}]
[null,{"$f":"'Emission data'!B6","v":"Elektrisch rendement"},{"$f":"IF($A1=1,IF('Emission data'!E6=0,\"--\",'Emission data'!E6/100),\"\")","v":"--"},null,{"$f":"IF(A1=1,IF('Emission data'!E6=0,\"\",IF(OR(INDEX(Data!G5:G12,'Emission data'!E3)>100*'Validation test'!C3,INDEX(Data!H5:H12,'Emission data'!E3)<100*'Validation test'!C3),language!A7, \"\")),\"\")","v":""}]
[null,{"$f":"Data!A43","v":"Gerapporteerde stoomproductie"},null,null,{"$f":"IF(Data!C47>0,language!A7,IF(Data!C47=0,language!A8,\"\"))","v":""}]
[null,{"$f":"'Emission data'!B4","v":"Bedrijfsvoering"},{"$f":"'Emission data'!F4","v":8760},{"$f":"IF(C5=\"\",\"\",language!A67)","v":"uur/jaar"},{"$f":"IF(AND($A1=1,C5<>\"\"),IF(OR(C5>8760,C5<0),language!A7,\"\"),\"\")","v":""}]
[null,{"$f":"Data!A49","v":"Gerapporteerde bedrijfstijd"},null,null,{"$f":"IF(Data!C53>0,language!A7,IF(Data!C53=0,language!A8,\"\"))","v":""}]
[null,{"$f":"language!A136","v":"Gemiddelde belasting"},{"$f":"IF($A1=1,IF('Emission data'!M23=\"\",\"\",'Emission data'!M23/100),\"\")","v":0},null,{"$f":"IF($A1=1,IF(C7=\"\",\"\",IF(OR(C7>Data!C115,C7<Data!B115),language!A7,\"\")),\"\")","v":"Afwijkend van verwachtingswaarde"}]
[null,{"$f":"CONCATENATE(language!A135,\" \",language!A39,\"-\",LOWER(language!A56),language!A141)","v":"Gerapporteerde CO2-emissie in % van de theoretische waarde"},{"$f":"IF(OR('Emission data'!M21=0,'Emission data'!M21=\"\"),\"\",'Emission data'!J35/'Emission data'!M21)","v":""},null,{"$f":"IF($A$1=1,IF(C8=\"\",\"\",IF(OR(C8>Data!C117,C8<Data!B117),language!$A$7,language!$A$8)),\"\")","v":""}]
[null,{"$f":"CONCATENATE(language!$A$138,\" \",language!A40,\"-\",language!$A$139)","v":"Emissie-eis NOx-concentratie"},null,null,{"$f":"IF(Data!C62=0,language!A8,IF(Data!C62=1,language!A7,IF(Data!C62=2,language!A7,\"\")))","v":""}]
[null,{"$f":"CONCATENATE(language!$A$135,\" \",language!A40,\"-\",language!$A$139)","v":"Gerapporteerde NOx-concentratie"},null,null,{"$f":"IF(Data!C71=0,language!A8,IF(Data!C71=1,language!A7,IF(Data!C71=2,language!A7,\"\")))","v":""}]
[null,{"$f":"CONCATENATE(language!$A$138,\" \",language!A38,\"-\",language!$A$139)","v":"Emissie-eis SO2-concentratie"},null,null,{"$f":"IF(Data!C101=0,language!A8,IF(Data!C101=1,language!A7,IF(Data!C101=2,language!A7,\"\")))","v":""}]
[null,{"$f":"CONCATENATE(language!$A$135,\" \",language!A38,\"-\",language!$A$139)","v":"Gerapporteerde SO2-concentratie"},null,null,{"$f":"IF(Data!C107=0,language!A8,IF(Data!C107=1,language!A7,IF(Data!C107=2,language!A7,\"\")))","v":""}]
[null,{"$f":"CONCATENATE(language!A135,\" \",language!A38,\"-\",LOWER(language!A56),language!A141)","v":"Gerapporteerde SO2-emissie in % van de theoretische waarde"},{"$f":"IF('Emission data'!M24=0,\"\",'Emission data'!J32/('Emission data'!M24*1000))","v":""},null,{"$f":"IF($A$1=1,IF(C13=\"\",\"\",IF(OR(C13>Data!C119,C13<Data!B119),language!$A$7,\"\")),\"\")","v":""}]
[null,{"$f":"CONCATENATE(language!A138,\" \",Data!A80,\"-\",language!A139)","v":"Emissie-eis STOF-concentratie"},null,null,{"$f":"IF(Data!C83=0,language!A8,IF(Data!C83=1,language!A7,IF(Data!C83=2,language!A7,\"\")))","v":""}]
[null,{"$f":"CONCATENATE(language!A135,\" \",Data!A80,\"-\",language!A139)","v":"Gerapporteerde STOF-concentratie"},null,null,{"$f":"IF(Data!C89=0,language!A8,IF(Data!C89=1,language!A7,IF(Data!C89=2,language!A7,\"\")))","v":""}]
[null,{"$f":"CONCATENATE(language!A135,\" \",Data!A92)","v":"Gerapporteerde STOF-emissie"},null,null,{"$f":"IF(Data!C95=0,language!A8,IF(Data!C95>0,language!A7, \"\"))","v":""}]
[null,{"$f":"CONCATENATE(language!A219,\" \",LOWER(language!A54))","v":"Temperatuur rookgas"},{"$f":"IF('Emission data'!E37=\"\",\"\",'Emission data'!E37)","v":""},{"$f":"IF(ISNUMBER(C17),\"°C\",\"\")","v":""},{"$f":"IF(AND(C17<>\"\",'Emission data'!K36<>\"\",'Emission data'!E37<'Emission data'!K36),language!A7,\"\")","v":""}]
[null,{"$f":"language!A221","v":"Dwarsdoorsnede afgaskanaal"},null,null,{"$f":"IF(Data!C125=0,language!A8,IF(Data!C125>0,language!A7, \"\"))","v":""}]

{"sheet":"Data","index":7,"n_rows":125,"n_cols":17,"rows_kept":125,"cut":false,"hidden":true,"merged":[]}
["Version","2024"]
[{"$f":"language!A97","v":"Geldigheid"},"2026-04-01"]
["Nu nog geldig",{"$f":"IF(NOW()>Data!B2,0,1)","v":1}]
["menu optie",0,null,null,null,null,{"$f":"language!A111","v":"Min rendement"},{"$f":"language!A112","v":"Max rendement"},null,null,2,null,"bij O2"]
[{"$f":"language!A26","v":"Bedrijfsvoering"},{"$f":"IF(OR(language!$A$99=\"\",language!$A$100=\"\"),\"\",CONCATENATE(IF('Emission data'!$H$4<>\"\",'Emission data'!H4,Data!C5),\" \",UPPER(D5),IF('Emission data'!$H$4<>\"\",\"\",CONCATENATE(\" (7 \",LOWER(language!$A$99),\"; 24 \",LOWER(language!$A$100),\")\"))))","v":"8760 UUR/JAAR (7 dagen/week; 24 uur/dag)"},{"$f":"TRUNC(8760)","v":8760},{"$f":"language!A67","v":"uur/jaar"},{"$f":"language!A102","v":"Installatie type"},{"$f":"language!A103","v":"KETEL"},0,0,null,{"$f":"language!A10","v":"Taal"},{"$f":"IF(language!A11=\"\",\"\",language!A11)","v":"ENGELS"},null,{"$f":"IF('Emission data'!M22=0,\"\",CONCATENATE(\" \",language!A94,\" \",'Emission data'!G34,\"% \",language!A37))","v":""}]
[null,{"$f":"IF(OR(language!$A$99=\"\",language!$A$100=\"\"),\"\",CONCATENATE(IF('Emission data'!$H$4<>\"\",'Emission data'!$H$4,Data!C6),\" \",UPPER(D6),IF('Emission data'!$H$4<>\"\",\"\",CONCATENATE(\" (7 \",LOWER(language!$A$99),\"; 16 \",LOWER(language!$A$100),\")\"))))","v":"5840 UUR/JAAR (7 dagen/week; 16 uur/dag)"},{"$f":"TRUNC(C5*2/3)","v":5840},{"$f":"D5","v":"uur/jaar"},null,{"$f":"language!A104","v":"KETEL MET STOOMTURBINE"},38,45,null,null,{"$f":"IF(language!A12=\"\",\"\",language!A12)","v":"NEDERLANDS"}]
[null,{"$f":"IF(OR(language!$A$99=\"\",language!$A$100=\"\"),\"\",CONCATENATE(IF('Emission data'!$H$4<>\"\",'Emission data'!$H$4,Data!C7),\" \",UPPER(D7),IF('Emission data'!$H$4<>\"\",\"\",CONCATENATE(\" (5 \",LOWER(language!$A$99),\"; 16 \",LOWER(language!$A$100),\")\"))))","v":"4171 UUR/JAAR (5 dagen/week; 16 uur/dag)"},{"$f":"TRUNC(C6*5/7)","v":4171},{"$f":"D6","v":"uur/jaar"},null,{"$f":"language!A105","v":"PROCESFORNUIS"},0,0,null,null,{"$f":"IF(language!A13=\"\",\"\",language!A13)","v":"POOLS"}]
[null,{"$f":"IF(OR(language!$A$99=\"\",language!$A$100=\"\"),\"\",CONCATENATE(IF('Emission data'!$H$4<>\"\",'Emission data'!$H$4,Data!C8),\" \",UPPER(D8),IF('Emission data'!$H$4<>\"\",\"\",CONCATENATE(\" (5 \",LOWER(language!$A$99),\"; 8 \",LOWER(language!$A$100),\")\"))))","v":"2085 UUR/JAAR (5 dagen/week; 8 uur/dag)"},{"$f":"TRUNC(C7/2)","v":2085},{"$f":"D7","v":"uur/jaar"},null,{"$f":"language!A106","v":"GASTURBINE"},30,40,null,null,{"$f":"IF(language!A14=\"\",\"\",language!A14)","v":"TSJECHISCH"}]
[null,{"$f":"IF('Emission data'!H4<>\"\",CONCATENATE('Emission data'!H4,\" \",UPPER(language!A67)),CONCATENATE(UPPER(language!A101),IF(ISNUMBER(C9),CONCATENATE(\" (\",ROUND(C9,0),\" \",UPPER(D9),\")\"),\"\")))","v":"STAND-BY"},{"$f":"IF(OR('Emission data'!M22=0,'Emission data'!E5=0),\"\",(IF('Emission data'!E22=\"\",0,'Emission data'!E22)+IF('Emission data'!G22=\"\",0,'Emission data'!G22)+IF('Emission data'!I22=\"\",0,'Emission data'!I22)+IF('Emission data'!K22=\"\",0,'Emission data'!K22))*1000000/3600/'Emission data'!E5)","v":""},{"$f":"D8","v":"uur/jaar"},null,{"$f":"language!A107","v":"WKK GASTURBINE"},50,60,null,null,{"$f":"IF(language!A15=\"\",\"\",language!A15)","v":"BULGAARS"}]
[null,null,null,null,null,{"$f":"language!A108","v":"ZUIGERMOTOR"},35,45,null,null,{"$f":"IF(language!A16=\"\",\"\",language!A16)","v":"KROATISCH"}]
[null,null,null,null,null,{"$f":"language!A109","v":"WKK ZUIGERMOTOR"},35,60,null,null,{"$f":"IF(language!A17=\"\",\"\",language!A17)","v":"DUITS"}]
[null,null,null,null,null,{"$f":"language!A110","v":"ANDERS"},0,0,null,null,{"$f":"IF(language!A18=\"\",\"\",language!A18)","v":"FRANS"}]
[null,null,null,null,null,null,null,null,null,null,{"$f":"IF(language!A19=\"\",\"\",language!A19)","v":""}]
[{"$f":"language!A113","v":"rij"},1,3,4,7,9,16,"4a","9a","15a",null,13,17,14,8,10,12]
[{"$f":"language!A114","v":"kolom"},{"$f":"language!A115","v":"brandstoftype"},{"$f":"language!A117","v":"% fossiel"},{"$f":"language!A118","v":"Onderste verbrandingswaarde"},{"$f":"language!A119","v":"Berekeningsmethode"},"CO2",{"$f":"language!A120","v":"Stoichiometrisch rookgasvolume Rgv"},{"$f":"language!A121","v":"onzekerheid"},{"$f":"H15","v":"onzekerheid"},{"$f":"I15","v":"onzekerheid"},{"$f":"language!A122","v":"eenheid"},"SO2",{"$f":"CONCATENATE('Gaseous fuels'!B18,\" \",'Gaseous fuels'!B16)","v":"  nat Stoichiometrisch rookgasvolume"},{"$f":"'Gaseous fuels'!B15","v":"Stoichiometrisch luchtverbruik"},{"$f":"'Gaseous fuels'!B9","v":"Koolstofdioxide"},{"$f":"'Gaseous fuels'!B11","v":"Waterdamp"},"SO2"]
[null,{"$f":"language!A116","v":"GEEN"},null,null,"\"\""]
[1,{"$f":"IF(INDEX('Gaseous fuels'!$D$2:$H$90,B$14,$A17)=\"\",\"\",INDEX('Gaseous fuels'!$D$2:$H$90,B$14,$A17))","v":"AARDGAS"},{"$f":"IF(INDEX('Gaseous fuels'!$D$2:$H$90,C$14,$A17)=\"\",\"\",INDEX('Gaseous fuels'!$D$2:$H$90,C$14,$A17))","v":100},{"$f":"IF(INDEX('Gaseous fuels'!$D$2:$H$90,D$14,$A17)=\"\",\"\",INDEX('Gaseous fuels'!$D$2:$H$90,D$14,$A17))","v":31.668546173147696},{"$f":"IF(INDEX('Gaseous fuels'!$D$2:$H$90,E$14,$A17)=\"\",\"\",INDEX('Gaseous fuels'!$D$2:$H$90,E$14,$A17))","v":"samenstelling"},{"$f":"IF(INDEX('Gaseous fuels'!$D$2:$H$90,F$14,$A17)=\"\",\"\",INDEX('Gaseous fuels'!$D$2:$H$90,F$14,$A17))","v":56.029105319939347},{"$f":"IF(INDEX('Gaseous fuels'!$D$2:$H$90,G$14,$A17)=\"\",\"\",INDEX('Gaseous fuels'!$D$2:$H$90,G$14,$A17))","v":7.70330287502515},{"$f":"IF(LEFT(E17,3)<>\"\",0.01,\"\")","v":0.01},{"$f":"IF(LEFT(E17,3)=\"sam\",0.02,IF(E17=\"\",\"\",0.1))","v":0.02},{"$f":"IF(LEFT(E17,3)=\"sam\",0.01,IF(E17=\"\",\"\",0.02))","v":0.01},"Nm3",{"$f":"IF(INDEX('Gaseous fuels'!$D$2:$H$90,L$14,$A17)=\"\",\"\",INDEX('Gaseous fuels'!$D$2:$H$90,L$14,$A17))","v":0},{"$f":"IF(INDEX('Gaseous fuels'!$D$2:$H$90,M$14,$A17)=\"\",\"\",INDEX('Gaseous fuels'!$D$2:$H$90,M$14,$A17))","v":9.3867093153055219},{"$f":"IF(INDEX('Gaseous fuels'!$D$2:$H$90,N$14,$A17)=\"\",\"\",INDEX('Gaseous fuels'!$D$2:$H$90,N$14,$A17))","v":8.4287599138739484},{"$f":"IF(INDEX('Gaseous fuels'!$D$2:$H$90,O$14,$A17)=\"\",\"\",INDEX('Gaseous fuels'!$D$2:$H$90,O$14,$A17))","v":0.89690470911101583},{"$f":"IF(INDEX('Gaseous fuels'!$D$2:$H$90,P$14,$A17)=\"\",\"\",INDEX('Gaseous fuels'!$D$2:$H$90,P$14,$A17))","v":1.6834064402803717},{"$f":"IF(INDEX('Gaseous fuels'!$D$2:$H$90,Q$14,$A17)=\"\",\"\",INDEX('Gaseous fuels'!$D$2:$H$90,Q$14,$A17))","v":0}]
[2,{"$f":"IF(INDEX('Gaseous fuels'!$D$2:$H$90,B$14,$A18)=\"\",\"\",INDEX('Gaseous fuels'!$D$2:$H$90,B$14,$A18))","v":"HC Gas"},{"$f":"IF(INDEX('Gaseous fuels'!$D$2:$H$90,C$14,$A18)=\"\",\"\",INDEX('Gaseous fuels'!$D$2:$H$90,C$14,$A18))","v":100},{"$f":"IF(INDEX('Gaseous fuels'!$D$2:$H$90,D$14,$A18)=\"\",\"\",INDEX('Gaseous fuels'!$D$2:$H$90,D$14,$A18))","v":36.271670288908943},{"$f":"IF(INDEX('Gaseous fuels'!$D$2:$H$90,E$14,$A18)=\"\",\"\",INDEX('Gaseous fuels'!$D$2:$H$90,E$14,$A18))","v":"samenstelling"},{"$f":"IF(INDEX('Gaseous fuels'!$D$2:$H$90,F$14,$A18)=\"\",\"\",INDEX('Gaseous fuels'!$D$2:$H$90,F$14,$A18))","v":56.744733211764981},{"$f":"IF(INDEX('Gaseous fuels'!$D$2:$H$90,G$14,$A18)=\"\",\"\",INDEX('Gaseous fuels'!$D$2:$H$90,G$14,$A18))","v":8.698378450702581},{"$f":"IF(LEFT(E18,3)<>\"\",0.01,\"\")","v":0.01},{"$f":"IF(LEFT(E18,3)=\"sam\",0.02,IF(E18=\"\",\"\",0.1))","v":0.02},{"$f":"IF(LEFT(E18,3)=\"sam\",0.01,IF(E18=\"\",\"\",0.02))","v":0.01},"Nm3",{"$f":"IF(INDEX('Gaseous fuels'!$D$2:$H$90,L$14,$A18)=\"\",\"\",INDEX('Gaseous fuels'!$D$2:$H$90,L$14,$A18))","v":0},{"$f":"IF(INDEX('Gaseous fuels'!$D$2:$H$90,M$14,$A18)=\"\",\"\",INDEX('Gaseous fuels'!$D$2:$H$90,M$14,$A18))","v":10.611722016053383},{"$f":"IF(INDEX('Gaseous fuels'!$D$2:$H$90,N$14,$A18)=\"\",\"\",INDEX('Gaseous fuels'!$D$2:$H$90,N$14,$A18))","v":9.6479476823136316},{"$f":"IF(INDEX('Gaseous fuels'!$D$2:$H$90,O$14,$A18)=\"\",\"\",INDEX('Gaseous fuels'!$D$2:$H$90,O$14,$A18))","v":1.0403934365117815},{"$f":"IF(INDEX('Gaseous fuels'!$D$2:$H$90,P$14,$A18)=\"\",\"\",INDEX('Gaseous fuels'!$D$2:$H$90,P$14,$A18))","v":1.9133435653508015},{"$f":"IF(INDEX('Gaseous fuels'!$D$2:$H$90,Q$14,$A18)=\"\",\"\",INDEX('Gaseous fuels'!$D$2:$H$90,Q$14,$A18))","v":0}]
[3,{"$f":"IF(INDEX('Gaseous fuels'!$D$2:$H$90,B$14,$A19)=\"\",\"\",INDEX('Gaseous fuels'!$D$2:$H$90,B$14,$A19))","v":"GF1"},{"$f":"IF(INDEX('Gaseous fuels'!$D$2:$H$90,C$14,$A19)=\"\",\"\",INDEX('Gaseous fuels'!$D$2:$H$90,C$14,$A19))","v":100},{"$f":"IF(INDEX('Gaseous fuels'!$D$2:$H$90,D$14,$A19)=\"\",\"\",INDEX('Gaseous fuels'!$D$2:$H$90,D$14,$A19))","v":28},{"$f":"IF(INDEX('Gaseous fuels'!$D$2:$H$90,E$14,$A19)=\"\",\"\",INDEX('Gaseous fuels'!$D$2:$H$90,E$14,$A19))","v":"DIN1942"},{"$f":"IF(INDEX('Gaseous fuels'!$D$2:$H$90,F$14,$A19)=\"\",\"\",INDEX('Gaseous fuels'!$D$2:$H$90,F$14,$A19))","v":60.97167755246987},{"$f":"IF(INDEX('Gaseous fuels'!$D$2:$H$90,G$14,$A19)=\"\",\"\",INDEX('Gaseous fuels'!$D$2:$H$90,G$14,$A19))","v":6.7622},{"$f":"IF(LEFT(E19,3)<>\"\",0.01,\"\")","v":0.01},0.1,{"$f":"IF(LEFT(E19,3)=\"sam\",0.01,IF(E19=\"\",\"\",0.02))","v":0.02},"Nm3",{"$f":"IF(INDEX('Gaseous fuels'!$D$2:$H$90,L$14,$A19)=\"\",\"\",INDEX('Gaseous fuels'!$D$2:$H$90,L$14,$A19))","v":0},{"$f":"IF(INDEX('Gaseous fuels'!$D$2:$H$90,M$14,$A19)=\"\",\"\",INDEX('Gaseous fuels'!$D$2:$H$90,M$14,$A19))","v":8.2971000000000004},{"$f":"IF(INDEX('Gaseous fuels'!$D$2:$H$90,N$14,$A19)=\"\",\"\",INDEX('Gaseous fuels'!$D$2:$H$90,N$14,$A19))","v":7.460700000000001},{"$f":"IF(INDEX('Gaseous fuels'!$D$2:$H$90,O$14,$A19)=\"\",\"\",INDEX('Gaseous fuels'!$D$2:$H$90,O$14,$A19))","v":0.86295999999999995},{"$f":"IF(INDEX('Gaseous fuels'!$D$2:$H$90,P$14,$A19)=\"\",\"\",INDEX('Gaseous fuels'!$D$2:$H$90,P$14,$A19))","v":1.6239999999999999},{"$f":"IF(INDEX('Gaseous fuels'!$D$2:$H$90,Q$14,$A19)=\"\",\"\",INDEX('Gaseous fuels'!$D$2:$H$90,Q$14,$A19))","v":0}]
[4,{"$f":"IF(INDEX('Gaseous fuels'!$D$2:$H$90,B$14,$A20)=\"\",\"\",INDEX('Gaseous fuels'!$D$2:$H$90,B$14,$A20))","v":"GF 2"},{"$f":"IF(INDEX('Gaseous fuels'!$D$2:$H$90,C$14,$A20)=\"\",\"\",INDEX('Gaseous fuels'!$D$2:$H$90,C$14,$A20))","v":100},{"$f":"IF(INDEX('Gaseous fuels'!$D$2:$H$90,D$14,$A20)=\"\",\"\",INDEX('Gaseous fuels'!$D$2:$H$90,D$14,$A20))","v":35},{"$f":"IF(INDEX('Gaseous fuels'!$D$2:$H$90,E$14,$A20)=\"\",\"\",INDEX('Gaseous fuels'!$D$2:$H$90,E$14,$A20))","v":"DIN1942"},{"$f":"IF(INDEX('Gaseous fuels'!$D$2:$H$90,F$14,$A20)=\"\",\"\",INDEX('Gaseous fuels'!$D$2:$H$90,F$14,$A20))","v":57.707457307123505},{"$f":"IF(INDEX('Gaseous fuels'!$D$2:$H$90,G$14,$A20)=\"\",\"\",INDEX('Gaseous fuels'!$D$2:$H$90,G$14,$A20))","v":8.4030000000000005},{"$f":"IF(LEFT(E20,3)<>\"\",0.01,\"\")","v":0.01},0.1,{"$f":"IF(LEFT(E20,3)=\"sam\",0.01,IF(E20=\"\",\"\",0.02))","v":0.02},"Nm3",{"$f":"IF(INDEX('Gaseous fuels'!$D$2:$H$90,L$14,$A20)=\"\",\"\",INDEX('Gaseous fuels'!$D$2:$H$90,L$14,$A20))","v":0},{"$f":"IF(INDEX('Gaseous fuels'!$D$2:$H$90,M$14,$A20)=\"\",\"\",INDEX('Gaseous fuels'!$D$2:$H$90,M$14,$A20))","v":10.341099999999999},{"$f":"IF(INDEX('Gaseous fuels'!$D$2:$H$90,N$14,$A20)=\"\",\"\",INDEX('Gaseous fuels'!$D$2:$H$90,N$14,$A20))","v":9.3360000000000003},{"$f":"IF(INDEX('Gaseous fuels'!$D$2:$H$90,O$14,$A20)=\"\",\"\",INDEX('Gaseous fuels'!$D$2:$H$90,O$14,$A20))","v":1.02095},{"$f":"IF(INDEX('Gaseous fuels'!$D$2:$H$90,P$14,$A20)=\"\",\"\",INDEX('Gaseous fuels'!$D$2:$H$90,P$14,$A20))","v":2.0496000000000003},{"$f":"IF(INDEX('Gaseous fuels'!$D$2:$H$90,Q$14,$A20)=\"\",\"\",INDEX('Gaseous fuels'!$D$2:$H$90,Q$14,$A20))","v":0}]
[5,{"$f":"IF(INDEX('Gaseous fuels'!$D$2:$H$90,B$14,$A21)=\"\",\"\",INDEX('Gaseous fuels'!$D$2:$H$90,B$14,$A21))","v":"GF 3"},{"$f":"IF(INDEX('Gaseous fuels'!$D$2:$H$90,C$14,$A21)=\"\",\"\",INDEX('Gaseous fuels'!$D$2:$H$90,C$14,$A21))","v":100},{"$f":"IF(INDEX('Gaseous fuels'!$D$2:$H$90,D$14,$A21)=\"\",\"\",INDEX('Gaseous fuels'!$D$2:$H$90,D$14,$A21))","v":40},{"$f":"IF(INDEX('Gaseous fuels'!$D$2:$H$90,E$14,$A21)=\"\",\"\",INDEX('Gaseous fuels'!$D$2:$H$90,E$14,$A21))","v":"DIN1942"},{"$f":"IF(INDEX('Gaseous fuels'!$D$2:$H$90,F$14,$A21)=\"\",\"\",INDEX('Gaseous fuels'!$D$2:$H$90,F$14,$A21))","v":56.075347184450322},{"$f":"IF(INDEX('Gaseous fuels'!$D$2:$H$90,G$14,$A21)=\"\",\"\",INDEX('Gaseous fuels'!$D$2:$H$90,G$14,$A21))","v":9.5749999999999993},{"$f":"IF(LEFT(E21,3)<>\"\",0.01,\"\")","v":0.01},0.1,{"$f":"IF(LEFT(E21,3)=\"sam\",0.01,IF(E21=\"\",\"\",0.02))","v":0.02},"Nm3",{"$f":"IF(INDEX('Gaseous fuels'!$D$2:$H$90,L$14,$A21)=\"\",\"\",INDEX('Gaseous fuels'!$D$2:$H$90,L$14,$A21))","v":0},{"$f":"IF(INDEX('Gaseous fuels'!$D$2:$H$90,M$14,$A21)=\"\",\"\",INDEX('Gaseous fuels'!$D$2:$H$90,M$14,$A21))","v":11.8011},{"$f":"IF(INDEX('Gaseous fuels'!$D$2:$H$90,N$14,$A21)=\"\",\"\",INDEX('Gaseous fuels'!$D$2:$H$90,N$14,$A21))","v":10.675500000000001},{"$f":"IF(INDEX('Gaseous fuels'!$D$2:$H$90,O$14,$A21)=\"\",\"\",INDEX('Gaseous fuels'!$D$2:$H$90,O$14,$A21))","v":1.1338000000000001},{"$f":"IF(INDEX('Gaseous fuels'!$D$2:$H$90,P$14,$A21)=\"\",\"\",INDEX('Gaseous fuels'!$D$2:$H$90,P$14,$A21))","v":2.3536000000000001},{"$f":"IF(INDEX('Gaseous fuels'!$D$2:$H$90,Q$14,$A21)=\"\",\"\",INDEX('Gaseous fuels'!$D$2:$H$90,Q$14,$A21))","v":0}]
[1,{"$f":"IF(INDEX('Liquid fuels'!$D$2:$H$51,B$14,$A22)=\"\",\"\",INDEX('Liquid fuels'!$D$2:$H$101,B$14,$A22))","v":"DIESEL"},{"$f":"IF(INDEX('Liquid fuels'!$D$2:$H$51,C$14,$A22)=\"\",\"\",INDEX('Liquid fuels'!$D$2:$H$101,C$14,$A22))","v":100},{"$f":"IF(INDEX('Liquid fuels'!$D$2:$H$51,D$14,$A22)=\"\",\"\",INDEX('Liquid fuels'!$D$2:$H$101,D$14,$A22))","v":42.48},{"$f":"IF(INDEX('Liquid fuels'!$D$2:$H$51,E$14,$A22)=\"\",\"\",INDEX('Liquid fuels'!$D$2:$H$101,E$14,$A22))","v":"samenstelling"},{"$f":"IF(INDEX('Liquid fuels'!$D$2:$H$51,F$14,$A22)=\"\",\"\",INDEX('Liquid fuels'!$D$2:$H$101,F$14,$A22))","v":74.352056597209},{"$f":"IF(INDEX('Liquid fuels'!$D$2:$H$51,G$14,$A22)=\"\",\"\",INDEX('Liquid fuels'!$D$2:$H$101,G$14,$A22))","v":10.401193581411476},{"$f":"IF(LEFT(E22,3)<>\"\",0.02,\"\")","v":0.02},0.02,{"$f":"IF(LEFT(E22,3)=\"sam\",0.02,IF(E22=\"\",\"\",0.05))","v":0.02},"kg",{"$f":"IF(INDEX('Liquid fuels'!$D$2:$H$51,L$14,$A22)=\"\",\"\",INDEX('Liquid fuels'!$D$2:$H$101,L$14,$A22))","v":8.4587161783520298E-2},{"$f":"IF(INDEX('Liquid fuels'!$D$2:$H$51,M$14,$A22)=\"\",\"\",INDEX('Liquid fuels'!$D$2:$H$101,M$14,$A22))","v":11.806788878563971},{"$f":"IF(INDEX('Liquid fuels'!$D$2:$H$51,N$14,$A22)=\"\",\"\",INDEX('Liquid fuels'!$D$2:$H$101,N$14,$A22))","v":11.136479602049928},{"$f":"IF(INDEX('Liquid fuels'!$D$2:$H$51,O$14,$A22)=\"\",\"\",INDEX('Liquid fuels'!$D$2:$H$101,O$14,$A22))","v":1.5965480143202064},{"$f":"IF(INDEX('Liquid fuels'!$D$2:$H$51,P$14,$A22)=\"\",\"\",INDEX('Liquid fuels'!$D$2:$H$101,P$14,$A22))","v":1.4055952971524954},{"$f":"IF(INDEX('Liquid fuels'!$D$2:$H$51,Q$14,$A22)=\"\",\"\",INDEX('Liquid fuels'!$D$2:$H$101,Q$14,$A22))","v":1.2576419213973797E-3}]
[2,{"$f":"IF(INDEX('Liquid fuels'!$D$2:$H$51,B$14,$A23)=\"\",\"\",INDEX('Liquid fuels'!$D$2:$H$101,B$14,$A23))","v":"HFO"},{"$f":"IF(INDEX('Liquid fuels'!$D$2:$H$51,C$14,$A23)=\"\",\"\",INDEX('Liquid fuels'!$D$2:$H$101,C$14,$A23))","v":100},{"$f":"IF(INDEX('Liquid fuels'!$D$2:$H$51,D$14,$A23)=\"\",\"\",INDEX('Liquid fuels'!$D$2:$H$101,D$14,$A23))","v":40.229999999999997},{"$f":"IF(INDEX('Liquid fuels'!$D$2:$H$51,E$14,$A23)=\"\",\"\",INDEX('Liquid fuels'!$D$2:$H$101,E$14,$A23))","v":"samenstelling"},{"$f":"IF(INDEX('Liquid fuels'!$D$2:$H$51,F$14,$A23)=\"\",\"\",INDEX('Liquid fuels'!$D$2:$H$101,F$14,$A23))","v":77.94575669957689},{"$f":"IF(INDEX('Liquid fuels'!$D$2:$H$51,G$14,$A23)=\"\",\"\",INDEX('Liquid fuels'!$D$2:$H$101,G$14,$A23))","v":9.8948885564353528},{"$f":"IF(LEFT(E23,3)<>\"\",0.02,\"\")","v":0.02},0.02,{"$f":"IF(LEFT(E23,3)=\"sam\",0.02,IF(E23=\"\",\"\",0.05))","v":0.02},"kg",{"$f":"IF(INDEX('Liquid fuels'!$D$2:$H$51,L$14,$A23)=\"\",\"\",INDEX('Liquid fuels'!$D$2:$H$101,L$14,$A23))","v":1.6523827666525714},{"$f":"IF(INDEX('Liquid fuels'!$D$2:$H$51,M$14,$A23)=\"\",\"\",INDEX('Liquid fuels'!$D$2:$H$101,M$14,$A23))","v":11.017218847138796},{"$f":"IF(INDEX('Liquid fuels'!$D$2:$H$51,N$14,$A23)=\"\",\"\",INDEX('Liquid fuels'!$D$2:$H$101,N$14,$A23))","v":10.482638163915775},{"$f":"IF(INDEX('Liquid fuels'!$D$2:$H$51,O$14,$A23)=\"\",\"\",INDEX('Liquid fuels'!$D$2:$H$101,O$14,$A23))","v":1.5850647223378569},{"$f":"IF(INDEX('Liquid fuels'!$D$2:$H$51,P$14,$A23)=\"\",\"\",INDEX('Liquid fuels'!$D$2:$H$101,P$14,$A23))","v":1.1223302907034429},{"$f":"IF(INDEX('Liquid fuels'!$D$2:$H$51,Q$14,$A23)=\"\",\"\",INDEX('Liquid fuels'!$D$2:$H$101,Q$14,$A23))","v":2.326637554585153E-2}]
[3,{"$f":"IF(INDEX('Liquid fuels'!$D$2:$H$51,B$14,$A24)=\"\",\"\",INDEX('Liquid fuels'!$D$2:$H$101,B$14,$A24))","v":"LFO"},{"$f":"IF(INDEX('Liquid fuels'!$D$2:$H$51,C$14,$A24)=\"\",\"\",INDEX('Liquid fuels'!$D$2:$H$101,C$14,$A24))","v":100},{"$f":"IF(INDEX('Liquid fuels'!$D$2:$H$51,D$14,$A24)=\"\",\"\",INDEX('Liquid fuels'!$D$2:$H$101,D$14,$A24))","v":42.65},{"$f":"IF(INDEX('Liquid fuels'!$D$2:$H$51,E$14,$A24)=\"\",\"\",INDEX('Liquid fuels'!$D$2:$H$101,E$14,$A24))","v":"samenstelling"},{"$f":"IF(INDEX('Liquid fuels'!$D$2:$H$51,F$14,$A24)=\"\",\"\",INDEX('Liquid fuels'!$D$2:$H$101,F$14,$A24))","v":74.15878812924808},{"$f":"IF(INDEX('Liquid fuels'!$D$2:$H$51,G$14,$A24)=\"\",\"\",INDEX('Liquid fuels'!$D$2:$H$101,G$14,$A24))","v":10.478166529491505},0.02,0.02,{"$f":"IF(LEFT(E24,3)=\"sam\",0.02,IF(E24=\"\",\"\",0.05))","v":0.02},"kg",{"$f":"IF(INDEX('Liquid fuels'!$D$2:$H$51,L$14,$A24)=\"\",\"\",INDEX('Liquid fuels'!$D$2:$H$101,L$14,$A24))","v":7.9569447379949212E-2},{"$f":"IF(INDEX('Liquid fuels'!$D$2:$H$51,M$14,$A24)=\"\",\"\",INDEX('Liquid fuels'!$D$2:$H$101,M$14,$A24))","v":11.912732111394472},{"$f":"IF(INDEX('Liquid fuels'!$D$2:$H$51,N$14,$A24)=\"\",\"\",INDEX('Liquid fuels'!$D$2:$H$101,N$14,$A24))","v":11.231129879321681},{"$f":"IF(INDEX('Liquid fuels'!$D$2:$H$51,O$14,$A24)=\"\",\"\",INDEX('Liquid fuels'!$D$2:$H$101,O$14,$A24))","v":1.5987705869619515},{"$f":"IF(INDEX('Liquid fuels'!$D$2:$H$51,P$14,$A24)=\"\",\"\",INDEX('Liquid fuels'!$D$2:$H$101,P$14,$A24))","v":1.4345655819029668},{"$f":"IF(INDEX('Liquid fuels'!$D$2:$H$51,Q$14,$A24)=\"\",\"\",INDEX('Liquid fuels'!$D$2:$H$101,Q$14,$A24))","v":1.1877729257641918E-3}]
[4,{"$f":"IF(INDEX('Liquid fuels'!$D$2:$H$51,B$14,$A25)=\"\",\"\",INDEX('Liquid fuels'!$D$2:$H$101,B$14,$A25))","v":"LF1"},{"$f":"IF(INDEX('Liquid fuels'!$D$2:$H$51,C$14,$A25)=\"\",\"\",INDEX('Liquid fuels'!$D$2:$H$101,C$14,$A25))","v":100},{"$f":"IF(INDEX('Liquid fuels'!$D$2:$H$51,D$14,$A25)=\"\",\"\",INDEX('Liquid fuels'!$D$2:$H$101,D$14,$A25))","v":41},{"$f":"IF(INDEX('Liquid fuels'!$D$2:$H$51,E$14,$A25)=\"\",\"\",INDEX('Liquid fuels'!$D$2:$H$101,E$14,$A25))","v":"DIN1942"},{"$f":"IF(INDEX('Liquid fuels'!$D$2:$H$51,F$14,$A25)=\"\",\"\",INDEX('Liquid fuels'!$D$2:$H$101,F$14,$A25))","v":75.949068426025022},{"$f":"IF(INDEX('Liquid fuels'!$D$2:$H$51,G$14,$A25)=\"\",\"\",INDEX('Liquid fuels'!$D$2:$H$101,G$14,$A25))","v":9.9817999999999998},0.02,0.1,{"$f":"IF(LEFT(E25,3)=\"sam\",0.02,IF(E25=\"\",\"\",0.05))","v":0.05},"kg",{"$f":"IF(INDEX('Liquid fuels'!$D$2:$H$51,L$14,$A25)=\"\",\"\",INDEX('Liquid fuels'!$D$2:$H$101,L$14,$A25))","v":0},{"$f":"IF(INDEX('Liquid fuels'!$D$2:$H$51,M$14,$A25)=\"\",\"\",INDEX('Liquid fuels'!$D$2:$H$101,M$14,$A25))","v":11.337399999999999},{"$f":"IF(INDEX('Liquid fuels'!$D$2:$H$51,N$14,$A25)=\"\",\"\",INDEX('Liquid fuels'!$D$2:$H$101,N$14,$A25))","v":10.636400000000002},{"$f":"IF(INDEX('Liquid fuels'!$D$2:$H$51,O$14,$A25)=\"\",\"\",INDEX('Liquid fuels'!$D$2:$H$101,O$14,$A25))","v":1.574022},{"$f":"IF(INDEX('Liquid fuels'!$D$2:$H$51,P$14,$A25)=\"\",\"\",INDEX('Liquid fuels'!$D$2:$H$101,P$14,$A25))","v":1.3556000000000004},{"$f":"IF(INDEX('Liquid fuels'!$D$2:$H$51,Q$14,$A25)=\"\",\"\",INDEX('Liquid fuels'!$D$2:$H$101,Q$14,$A25))","v":0}]
[5,{"$f":"IF(INDEX('Liquid fuels'!$D$2:$H$51,B$14,$A26)=\"\",\"\",INDEX('Liquid fuels'!$D$2:$H$101,B$14,$A26))","v":"LF 2"},{"$f":"IF(INDEX('Liquid fuels'!$D$2:$H$51,C$14,$A26)=\"\",\"\",INDEX('Liquid fuels'!$D$2:$H$101,C$14,$A26))","v":100},{"$f":"IF(INDEX('Liquid fuels'!$D$2:$H$51,D$14,$A26)=\"\",\"\",INDEX('Liquid fuels'!$D$2:$H$101,D$14,$A26))","v":45},{"$f":"IF(INDEX('Liquid fuels'!$D$2:$H$51,E$14,$A26)=\"\",\"\",INDEX('Liquid fuels'!$D$2:$H$101,E$14,$A26))","v":"DIN1942"},{"$f":"IF(INDEX('Liquid fuels'!$D$2:$H$51,F$14,$A26)=\"\",\"\",INDEX('Liquid fuels'!$D$2:$H$101,F$14,$A26))","v":70.840833146783794},{"$f":"IF(INDEX('Liquid fuels'!$D$2:$H$51,G$14,$A26)=\"\",\"\",INDEX('Liquid fuels'!$D$2:$H$101,G$14,$A26))","v":10.865},0.02,0.1,{"$f":"IF(LEFT(E26,3)=\"sam\",0.02,IF(E26=\"\",\"\",0.05))","v":0.05},"kg",{"$f":"IF(INDEX('Liquid fuels'!$D$2:$H$51,L$14,$A26)=\"\",\"\",INDEX('Liquid fuels'!$D$2:$H$101,L$14,$A26))","v":0},{"$f":"IF(INDEX('Liquid fuels'!$D$2:$H$51,M$14,$A26)=\"\",\"\",INDEX('Liquid fuels'!$D$2:$H$101,M$14,$A26))","v":12.5878},{"$f":"IF(INDEX('Liquid fuels'!$D$2:$H$51,N$14,$A26)=\"\",\"\",INDEX('Liquid fuels'!$D$2:$H$101,N$14,$A26))","v":11.706400000000002},{"$f":"IF(INDEX('Liquid fuels'!$D$2:$H$51,O$14,$A26)=\"\",\"\",INDEX('Liquid fuels'!$D$2:$H$101,O$14,$A26))","v":1.6113900000000001},{"$f":"IF(INDEX('Liquid fuels'!$D$2:$H$51,P$14,$A26)=\"\",\"\",INDEX('Liquid fuels'!$D$2:$H$101,P$14,$A26))","v":1.7228000000000003},{"$f":"IF(INDEX('Liquid fuels'!$D$2:$H$51,Q$14,$A26)=\"\",\"\",INDEX('Liquid fuels'!$D$2:$H$101,Q$14,$A26))","v":0}]
[1,{"$f":"IF(INDEX('Solid fuels'!$D$2:$H$153,B$14,$A27)=\"\",\"\",INDEX('Solid fuels'!$D$2:$H$102,B$14,$A27))","v":"KOLEN"},{"$f":"IF(INDEX('Solid fuels'!$D$2:$H$153,C$14,$A27)=\"\",\"\",INDEX('Solid fuels'!$D$2:$H$102,C$14,$A27))","v":100},{"$f":"IF(INDEX('Solid fuels'!$D$2:$H$153,D$14,$A27)=\"\",\"\",INDEX('Solid fuels'!$D$2:$H$102,D$14,$A27))","v":25.87},{"$f":"IF(INDEX('Solid fuels'!$D$2:$H$153,E$14,$A27)=\"\",\"\",INDEX('Solid fuels'!$D$2:$H$102,E$14,$A27))","v":"samenstelling"},{"$f":"IF(INDEX('Solid fuels'!$D$2:$H$153,F$14,$A27)=\"\",\"\",INDEX('Solid fuels'!$D$2:$H$102,F$14,$A27))","v":95.956156100561984},{"$f":"IF(INDEX('Solid fuels'!$D$2:$H$153,G$14,$A27)=\"\",\"\",INDEX('Solid fuels'!$D$2:$H$102,G$14,$A27))","v":6.8011773001766267},0.02,0.02,{"$f":"IF(LEFT(E27,3)=\"sam\",0.04,IF(E27=\"\",\"\",0.07))","v":0.04},"kg",{"$f":"IF(INDEX('Solid fuels'!$D$2:$H$153,L$14,$A27)=\"\",\"\",INDEX('Solid fuels'!$D$2:$H$102,L$14,$A27))","v":0.70837415640031332},{"$f":"IF(INDEX('Solid fuels'!$D$2:$H$153,M$14,$A27)=\"\",\"\",INDEX('Solid fuels'!$D$2:$H$102,M$14,$A27))","v":7.3625714269090698},{"$f":"IF(INDEX('Solid fuels'!$D$2:$H$153,N$14,$A27)=\"\",\"\",INDEX('Solid fuels'!$D$2:$H$102,N$14,$A27))","v":6.9942478693381442},{"$f":"IF(INDEX('Solid fuels'!$D$2:$H$153,O$14,$A27)=\"\",\"\",INDEX('Solid fuels'!$D$2:$H$102,O$14,$A27))","v":1.2547978363500125},{"$f":"IF(INDEX('Solid fuels'!$D$2:$H$153,P$14,$A27)=\"\",\"\",INDEX('Solid fuels'!$D$2:$H$102,P$14,$A27))","v":0.56139412673244304},{"$f":"IF(INDEX('Solid fuels'!$D$2:$H$153,Q$14,$A27)=\"\",\"\",INDEX('Solid fuels'!$D$2:$H$102,Q$14,$A27))","v":6.4139737991266372E-3}]
[2,{"$f":"IF(INDEX('Solid fuels'!$D$2:$H$153,B$14,$A28)=\"\",\"\",INDEX('Solid fuels'!$D$2:$H$102,B$14,$A28))","v":"SF 1"},{"$f":"IF(INDEX('Solid fuels'!$D$2:$H$153,C$14,$A28)=\"\",\"\",INDEX('Solid fuels'!$D$2:$H$102,C$14,$A28))","v":100},{"$f":"IF(INDEX('Solid fuels'!$D$2:$H$153,D$14,$A28)=\"\",\"\",INDEX('Solid fuels'!$D$2:$H$102,D$14,$A28))","v":10},{"$f":"IF(INDEX('Solid fuels'!$D$2:$H$153,E$14,$A28)=\"\",\"\",INDEX('Solid fuels'!$D$2:$H$102,E$14,$A28))","v":"DIN1942"},{"$f":"IF(INDEX('Solid fuels'!$D$2:$H$153,F$14,$A28)=\"\",\"\",INDEX('Solid fuels'!$D$2:$H$102,F$14,$A28))","v":107.1455566593695},{"$f":"IF(INDEX('Solid fuels'!$D$2:$H$153,G$14,$A28)=\"\",\"\",INDEX('Solid fuels'!$D$2:$H$102,G$14,$A28))","v":2.8360000000000003},0.02,0.1,{"$f":"IF(LEFT(E28,3)=\"sam\",0.04,IF(E28=\"\",\"\",0.07))","v":7.0000000000000007E-2},"kg",{"$f":"IF(INDEX('Solid fuels'!$D$2:$H$153,L$14,$A28)=\"\",\"\",INDEX('Solid fuels'!$D$2:$H$102,L$14,$A28))","v":0},{"$f":"IF(INDEX('Solid fuels'!$D$2:$H$153,M$14,$A28)=\"\",\"\",INDEX('Solid fuels'!$D$2:$H$102,M$14,$A28))","v":3.7656000000000001},{"$f":"IF(INDEX('Solid fuels'!$D$2:$H$153,N$14,$A28)=\"\",\"\",INDEX('Solid fuels'!$D$2:$H$102,N$14,$A28))","v":2.9028},{"$f":"IF(INDEX('Solid fuels'!$D$2:$H$153,O$14,$A28)=\"\",\"\",INDEX('Solid fuels'!$D$2:$H$102,O$14,$A28))","v":0.54159999999999997},{"$f":"IF(INDEX('Solid fuels'!$D$2:$H$153,P$14,$A28)=\"\",\"\",INDEX('Solid fuels'!$D$2:$H$102,P$14,$A28))","v":0.93},{"$f":"IF(INDEX('Solid fuels'!$D$2:$H$153,Q$14,$A28)=\"\",\"\",INDEX('Solid fuels'!$D$2:$H$102,Q$14,$A28))","v":0}]
[3,{"$f":"IF(INDEX('Solid fuels'!$D$2:$H$153,B$14,$A29)=\"\",\"\",INDEX('Solid fuels'!$D$2:$H$102,B$14,$A29))","v":"SF 2"},{"$f":"IF(INDEX('Solid fuels'!$D$2:$H$153,C$14,$A29)=\"\",\"\",INDEX('Solid fuels'!$D$2:$H$102,C$14,$A29))","v":50},{"$f":"IF(INDEX('Solid fuels'!$D$2:$H$153,D$14,$A29)=\"\",\"\",INDEX('Solid fuels'!$D$2:$H$102,D$14,$A29))","v":15},{"$f":"IF(INDEX('Solid fuels'!$D$2:$H$153,E$14,$A29)=\"\",\"\",INDEX('Solid fuels'!$D$2:$H$102,E$14,$A29))","v":"DIN1942"},{"$f":"IF(INDEX('Solid fuels'!$D$2:$H$153,F$14,$A29)=\"\",\"\",INDEX('Solid fuels'!$D$2:$H$102,F$14,$A29))","v":100.4456621759919},{"$f":"IF(INDEX('Solid fuels'!$D$2:$H$153,G$14,$A29)=\"\",\"\",INDEX('Solid fuels'!$D$2:$H$102,G$14,$A29))","v":4.0289999999999999},0.02,0.1,{"$f":"IF(LEFT(E29,3)=\"sam\",0.04,IF(E29=\"\",\"\",0.07))","v":7.0000000000000007E-2},"kg",{"$f":"IF(INDEX('Solid fuels'!$D$2:$H$153,L$14,$A29)=\"\",\"\",INDEX('Solid fuels'!$D$2:$H$102,L$14,$A29))","v":0},{"$f":"IF(INDEX('Solid fuels'!$D$2:$H$153,M$14,$A29)=\"\",\"\",INDEX('Solid fuels'!$D$2:$H$102,M$14,$A29))","v":4.8756000000000004},{"$f":"IF(INDEX('Solid fuels'!$D$2:$H$153,N$14,$A29)=\"\",\"\",INDEX('Solid fuels'!$D$2:$H$102,N$14,$A29))","v":4.1337999999999999},{"$f":"IF(INDEX('Solid fuels'!$D$2:$H$153,O$14,$A29)=\"\",\"\",INDEX('Solid fuels'!$D$2:$H$102,O$14,$A29))","v":0.76159999999999994},{"$f":"IF(INDEX('Solid fuels'!$D$2:$H$153,P$14,$A29)=\"\",\"\",INDEX('Solid fuels'!$D$2:$H$102,P$14,$A29))","v":0.84700000000000009},{"$f":"IF(INDEX('Solid fuels'!$D$2:$H$153,Q$14,$A29)=\"\",\"\",INDEX('Solid fuels'!$D$2:$H$102,Q$14,$A29))","v":0}]
[4,{"$f":"IF(INDEX('Solid fuels'!$D$2:$H$153,B$14,$A30)=\"\",\"\",INDEX('Solid fuels'!$D$2:$H$102,B$14,$A30))","v":"SF 3"},{"$f":"IF(INDEX('Solid fuels'!$D$2:$H$153,C$14,$A30)=\"\",\"\",INDEX('Solid fuels'!$D$2:$H$102,C$14,$A30))","v":100},{"$f":"IF(INDEX('Solid fuels'!$D$2:$H$153,D$14,$A30)=\"\",\"\",INDEX('Solid fuels'!$D$2:$H$102,D$14,$A30))","v":20},{"$f":"IF(INDEX('Solid fuels'!$D$2:$H$153,E$14,$A30)=\"\",\"\",INDEX('Solid fuels'!$D$2:$H$102,E$14,$A30))","v":"DIN1942"},{"$f":"IF(INDEX('Solid fuels'!$D$2:$H$153,F$14,$A30)=\"\",\"\",INDEX('Solid fuels'!$D$2:$H$102,F$14,$A30))","v":97.095714934303089},{"$f":"IF(INDEX('Solid fuels'!$D$2:$H$153,G$14,$A30)=\"\",\"\",INDEX('Solid fuels'!$D$2:$H$102,G$14,$A30))","v":5.2220000000000004},0.02,0.1,{"$f":"IF(LEFT(E30,3)=\"sam\",0.04,IF(E30=\"\",\"\",0.07))","v":7.0000000000000007E-2},"kg",{"$f":"IF(INDEX('Solid fuels'!$D$2:$H$153,L$14,$A30)=\"\",\"\",INDEX('Solid fuels'!$D$2:$H$102,L$14,$A30))","v":0},{"$f":"IF(INDEX('Solid fuels'!$D$2:$H$153,M$14,$A30)=\"\",\"\",INDEX('Solid fuels'!$D$2:$H$102,M$14,$A30))","v":5.9856000000000007},{"$f":"IF(INDEX('Solid fuels'!$D$2:$H$153,N$14,$A30)=\"\",\"\",INDEX('Solid fuels'!$D$2:$H$102,N$14,$A30))","v":5.3648000000000007},{"$f":"IF(INDEX('Solid fuels'!$D$2:$H$153,O$14,$A30)=\"\",\"\",INDEX('Solid fuels'!$D$2:$H$102,O$14,$A30))","v":0.98159999999999992},{"$f":"IF(INDEX('Solid fuels'!$D$2:$H$153,P$14,$A30)=\"\",\"\",INDEX('Solid fuels'!$D$2:$H$102,P$14,$A30))","v":0.76400000000000001},{"$f":"IF(INDEX('Solid fuels'!$D$2:$H$153,Q$14,$A30)=\"\",\"\",INDEX('Solid fuels'!$D$2:$H$102,Q$14,$A30))","v":0}]
[5,{"$f":"IF(INDEX('Solid fuels'!$D$2:$H$153,B$14,$A31)=\"\",\"\",INDEX('Solid fuels'!$D$2:$H$102,B$14,$A31))","v":"SF 4"},{"$f":"IF(INDEX('Solid fuels'!$D$2:$H$153,C$14,$A31)=\"\",\"\",INDEX('Solid fuels'!$D$2:$H$102,C$14,$A31))","v":100},{"$f":"IF(INDEX('Solid fuels'!$D$2:$H$153,D$14,$A31)=\"\",\"\",INDEX('Solid fuels'!$D$2:$H$102,D$14,$A31))","v":25},{"$f":"IF(INDEX('Solid fuels'!$D$2:$H$153,E$14,$A31)=\"\",\"\",INDEX('Solid fuels'!$D$2:$H$102,E$14,$A31))","v":"DIN1942"},{"$f":"IF(INDEX('Solid fuels'!$D$2:$H$153,F$14,$A31)=\"\",\"\",INDEX('Solid fuels'!$D$2:$H$102,F$14,$A31))","v":95.085746589289798},{"$f":"IF(INDEX('Solid fuels'!$D$2:$H$153,G$14,$A31)=\"\",\"\",INDEX('Solid fuels'!$D$2:$H$102,G$14,$A31))","v":6.415},0.02,0.1,{"$f":"IF(LEFT(E31,3)=\"sam\",0.04,IF(E31=\"\",\"\",0.07))","v":7.0000000000000007E-2},"kg",{"$f":"IF(INDEX('Solid fuels'!$D$2:$H$153,L$14,$A31)=\"\",\"\",INDEX('Solid fuels'!$D$2:$H$102,L$14,$A31))","v":0},{"$f":"IF(INDEX('Solid fuels'!$D$2:$H$153,M$14,$A31)=\"\",\"\",INDEX('Solid fuels'!$D$2:$H$102,M$14,$A31))","v":7.0956000000000001},{"$f":"IF(INDEX('Solid fuels'!$D$2:$H$153,N$14,$A31)=\"\",\"\",INDEX('Solid fuels'!$D$2:$H$102,N$14,$A31))","v":6.5958000000000006},{"$f":"IF(INDEX('Solid fuels'!$D$2:$H$153,O$14,$A31)=\"\",\"\",INDEX('Solid fuels'!$D$2:$H$102,O$14,$A31))","v":1.2015999999999998},{"$f":"IF(INDEX('Solid fuels'!$D$2:$H$153,P$14,$A31)=\"\",\"\",INDEX('Solid fuels'!$D$2:$H$102,P$14,$A31))","v":0.68100000000000005},{"$f":"IF(INDEX('Solid fuels'!$D$2:$H$153,Q$14,$A31)=\"\",\"\",INDEX('Solid fuels'!$D$2:$H$102,Q$14,$A31))","v":0}]
[]
[{"$f":"language!A123","v":"VERBRANDING"}]
[{"$f":"language!A124","v":"LEVERING"}]
[]
[{"$f":"IF('Emission data'!$C$33=\"\",language!A125,UPPER('Emission data'!$C$33))","v":"HF"},{"$f":"CONCATENATE(A36,\"-\",LOWER(language!$A$56))","v":"HF-emissie"}]
[{"$f":"IF('Emission data'!$C$33=\"\",language!A126,UPPER('Emission data'!$C$33))","v":"HCl"},{"$f":"CONCATENATE(A37,\"-\",LOWER(language!$A$56))","v":"HCl-emissie"}]
[{"$f":"IF('Emission data'!$C$33=\"\",language!A127,UPPER('Emission data'!$C$33))","v":"CxHy"},{"$f":"CONCATENATE(A38,\"-\",LOWER(language!$A$56))","v":"CxHy-emissie"}]
[{"$f":"IF('Emission data'!$C$33=\"\",language!A128,UPPER('Emission data'!$C$33))","v":"CO"},{"$f":"CONCATENATE(A39,\"-\",LOWER(language!$A$56))","v":"CO-emissie"}]
[{"$f":"IF('Emission data'!$C$33=\"\",language!A129,UPPER('Emission data'!$C$33))","v":"STOF"},{"$f":"CONCATENATE(A40,\"-\",LOWER(language!$A$56))","v":"STOF-emissie"}]
[]
[null,null,{"$f":"language!A130","v":"Score"},"min","max"]
[{"$f":"CONCATENATE(language!A135,\" \",LOWER(language!A131))","v":"Gerapporteerde stoomproductie"},{"$f":"IF($B3=1,IF(OR('Emission data'!E3=4,'Emission data'!E3=6),\"--\",language!A132),\"--\")","v":"niet relevant/onbekend"},-1,0.8,1]
[null,{"$f":"IF($B3=1,IF(OR('Emission data'!E8=\"\",'Emission data'!E8=0),\"--\",CONCATENATE(ROUND('Emission data'!E8*D43,1),\"-\",ROUND('Emission data'!E8*E43,1),\" \",language!A66)),\"--\")","v":"62,6-78,3 ton/uur"},0]
[null,{"$f":"IF($B3=1,IF(OR('Emission data'!E8=\"\",'Emission data'!E8=0),\"--\",CONCATENATE(\"<\",ROUND('Emission data'!E8*D43,1),\" \",language!A66)),\"--\")","v":"<62,6 ton/uur"},{"$f":"IF(B45=\"--\",0,1)","v":1}]
[null,{"$f":"IF($B3=1,IF(OR('Emission data'!E8=\"\",'Emission data'!E8=0),\"--\",CONCATENATE(\">\",ROUND('Emission data'!E8*E43,1),\" \",language!A66)),\"--\")","v":">78,3 ton/uur"},{"$f":"IF(B46=\"--\",0,1)","v":1}]
[{"$f":"language!A133","v":"Keuze"},1,{"$f":"INDEX(C43:C46,B47)","v":-1}]
[null,null,{"$f":"C42","v":"Score"},"min","max"]
[{"$f":"CONCATENATE(language!A135,\" \",LOWER(language!A134))","v":"Gerapporteerde bedrijfstijd"},{"$f":"IF($B3=1,language!A132,\"--\")","v":"niet relevant/onbekend"},-1,0.8,1.2]
[null,{"$f":"IF(OR($B3=0,'Emission data'!F4=\"\"),\"--\",CONCATENATE(ROUND('Emission data'!F4*IF('Emission data'!E4=5,1,D49),0),\"-\",ROUND('Emission data'!F4*IF('Emission data'!E4=5,E49,1),0),\" \",language!A67))","v":"7008-8760 uur/jaar"},0]
[null,{"$f":"IF(OR($B3=0,'Emission data'!F4=\"\"),\"--\",CONCATENATE(\"< \",ROUND('Emission data'!F4*IF('Emission data'!E4=5,1,D49),0),\" \",language!A67))","v":"< 7008 uur/jaar"},{"$f":"IF(B51=\"--\",0,1)","v":1}]
[null,{"$f":"IF(OR($B3=0,'Emission data'!F4=\"\"),\"--\",CONCATENATE(\"> \",ROUND('Emission data'!F4*IF('Emission data'!E4=5,E49,1),0),\" \",language!A67))","v":"> 8760 uur/jaar"},{"$f":"IF(B52=\"--\",0,1)","v":1}]
[{"$f":"A47","v":"Keuze"},1,{"$f":"INDEX(C49:C52,B53)","v":-1}]
[null,null,{"$f":"C48","v":"Score"},"min","max"]
[{"$f":"CONCATENATE(language!A137,\" \",language!A40)","v":"Emissie-eis NOx"},{"$f":"IF($B3=1,language!A132,\"--\")","v":"niet relevant/onbekend"},-1,1,1.5]
[null,{"$f":"IF(OR($B3=0,'Emission data'!G31=\"\",'Emission data'!G31=0),\"--\",CONCATENATE(ROUND('Emission data'!G31*D55,0),\"-\",ROUND(E55*'Emission data'!G31,0),\"  \",language!A93,\" \",M5))","v":"--"},{"$f":"IF(B56=\"--\",-1,0)","v":-1}]
[null,{"$f":"IF(OR($B3=0,'Emission data'!G31=\"\",'Emission data'!G31=0),\"--\",CONCATENATE(\"< \",ROUND('Emission data'!G31*D55,0),\"  \",language!A93,\" \",M5))","v":"--"},{"$f":"IF(B57=\"--\",-1,1)","v":-1}]
[null,{"$f":"IF(OR($B3=0,'Emission data'!G31=\"\",'Emission data'!G31=0),\"--\",CONCATENATE(\">\",ROUND(E55*'Emission data'!G31,0),\"  \",language!A93,\" \",M5))","v":"--"},{"$f":"IF(B58=\"--\",-1,2)","v":-1}]
[null,{"$f":"IF(OR($B3=0,'Emission data'!M22=0,'Emission data'!L31=0,'Emission data'!L31=\"\"),\"--\",CONCATENATE(ROUND('Emission data'!J31/'Emission data'!M22*D55,0),\"-\",ROUND(E55*'Emission data'!J31/'Emission data'!M22,0),\" \",language!A96))","v":"--"},{"$f":"IF(B59=\"--\",-1,0)","v":-1}]
[null,{"$f":"IF(OR($B3=0,'Emission data'!M22=0,'Emission data'!L31=0,'Emission data'!L31=\"\"),\"--\",CONCATENATE(\"< \",ROUND('Emission data'!J31/'Emission data'!M22*D55,0),\" \",language!A96))","v":"--"},{"$f":"IF(B60=\"--\",-1,1)","v":-1}]
[null,{"$f":"IF(OR($B3=0,'Emission data'!M22=0,'Emission data'!L31=0,'Emission data'!L31=\"\"),\"--\",CONCATENATE(\"> \",ROUND(E55*'Emission data'!J31/'Emission data'!M22,0),\" \",language!A96))","v":"--"},{"$f":"IF(B61=\"--\",-1,2)","v":-1}]
[{"$f":"A53","v":"Keuze"},1,{"$f":"INDEX(C55:C61,B62)","v":-1}]
[null,null,{"$f":"C54","v":"Score"},"min","max"]
[{"$f":"'Validation test'!B10","v":"Gerapporteerde NOx-concentratie"},{"$f":"IF($B3=1,language!A132,\"--\")","v":"niet relevant/onbekend"},-1,0.8,1.2]
[null,{"$f":"IF(OR($B3=0,'Emission data'!G31=\"\",'Emission data'!G31=0),\"--\",CONCATENATE(ROUND('Emission data'!G31*D64,0),\"-\",ROUND(E64*'Emission data'!G31,0),\"  \",language!A93,\" \",M5))","v":"--"},{"$f":"IF(B65=\"--\",-1,0)","v":-1}]
[null,{"$f":"IF(OR($B3=0,'Emission data'!G31=\"\",'Emission data'!G31=0),\"--\",CONCATENATE(\"< \",ROUND('Emission data'!G31*D64,0),\"  \",language!A93,\" \",M5))","v":"--"},{"$f":"IF(B66=\"--\",-1,1)","v":-1}]
[null,{"$f":"IF(OR($B3=0,'Emission data'!G31=\"\",'Emission data'!G31=0),\"--\",CONCATENATE(\">\",ROUND(E64*'Emission data'!G31,0),\"  \",language!A93,\" \",M5))","v":"--"},{"$f":"IF(B67=\"--\",-1,2)","v":-1}]
[null,{"$f":"IF(OR($B3=0,'Emission data'!M22=0,'Emission data'!L31=0,'Emission data'!L31=\"\"),\"--\",CONCATENATE(ROUND('Emission data'!J31/'Emission data'!M22*D64,0),\"-\",ROUND(E64*'Emission data'!J31/'Emission data'!M22,0),\" \",language!A96))","v":"--"},{"$f":"IF(B68=\"--\",-1,0)","v":-1}]
[null,{"$f":"IF(OR($B3=0,'Emission data'!M22=0,'Emission data'!L31=0,'Emission data'!L31=\"\"),\"--\",CONCATENATE(\"< \",ROUND('Emission data'!J31/'Emission data'!M22*D64,0),\" \",language!A96))","v":"--"},{"$f":"IF(B69=\"--\",-1,1)","v":-1}]
[null,{"$f":"IF(OR($B3=0,'Emission data'!M22=0,'Emission data'!L31=0,'Emission data'!L31=\"\"),\"--\",CONCATENATE(\"> \",ROUND(E64*'Emission data'!J31/'Emission data'!M22,0),\" \",language!A96))","v":"--"},{"$f":"IF(B70=\"--\",-1,2)","v":-1}]
[{"$f":"A62","v":"Keuze"},1,{"$f":"INDEX(C64:C70,B71)","v":-1}]
[null,null,{"$f":"C54","v":"Score"},"min","max"]
[{"$f":"CONCATENATE(language!A135,\" \",language!A40,\"-\",LOWER(language!A56))","v":"Gerapporteerde NOx-emissie"},{"$f":"IF($B3=1,language!A132,\"--\")","v":"niet relevant/onbekend"},-1,0.8,1.2]
[null,{"$f":"IF(OR($B3=0,D74=\"\",D74=0),\"--\",CONCATENATE(ROUND(D75*D73,0),\"-\",ROUND(D75*E73,0),\" \",E75))","v":"--"},{"$f":"IF(B74=\"--\",-1,0)","v":-1},{"$f":"'Emission data'!J$31","v":0},{"$f":"'Emission data'!J$34","v":""}]
[null,{"$f":"IF(OR($B3=0,D74=\"\",D74=0),\"--\",CONCATENATE(\"< \", ROUND(D75*D73,0),\" \",E75))","v":"--"},{"$f":"IF(B75=\"--\",-1,1)","v":-1},{"$f":"IF(D74=\"\",\"--\",IF(D74>100000000,D74/1000000,IF(D74>100000,D74/1000,D74)))","v":0},{"$f":"IF(D74>100000000,language!$A$90,IF(D74>100000,language!$A$89,language!$A$83))","v":"kg/jaar"}]
[null,{"$f":"IF(OR($B3=0,D74=\"\",D74=0),\"--\",CONCATENATE(\"> \", ROUND(D75*E73,0),\" \",E75))","v":"--"},{"$f":"IF(B76=\"--\",-1,2)","v":-1}]
[{"$f":"A62","v":"Keuze"},1,{"$f":"INDEX(C73:C76,B77)","v":-1}]
[null,null,{"$f":"C72","v":"Score"},"min","max"]
[{"$f":"CONCATENATE(language!A135,\" \",language!A137)","v":"Gerapporteerde Emissie-eis"},{"$f":"IF($B3=1,language!A132,\"--\")","v":"niet relevant/onbekend"},-1,1,2]
[{"$f":"INDEX(A36:A40,'Emission data'!B33)","v":"STOF"},{"$f":"IF(OR($B3=0,'Emission data'!G33=\"\",'Emission data'!G33=0),\"--\",CONCATENATE(ROUND('Emission data'!G33*D79,0),\"-\",ROUND(E79*'Emission data'!G33,0),\"  \",language!A93,\" \",M5))","v":"--"},{"$f":"IF(B80=\"--\",-1,0)","v":-1}]
[null,{"$f":"IF(OR($B3=0,'Emission data'!G33=\"\",'Emission data'!G33=0),\"--\",CONCATENATE(\"< \",ROUND('Emission data'!G33*D79,0),\"  \",language!A93,\" \",M5))","v":"--"},{"$f":"IF(B81=\"--\",-1,1)","v":-1}]
[null,{"$f":"IF(OR($B3=0,'Emission data'!G33=\"\",'Emission data'!G33=0),\"--\",CONCATENATE(\">\",ROUND(E79*'Emission data'!G33,0),\"  \",language!A93,\" \",M5))","v":"--"},{"$f":"IF(B82=\"--\",-1,2)","v":-1}]
[{"$f":"A77","v":"Keuze"},1,{"$f":"INDEX(C79:C82,B83)","v":-1}]
[null,null,{"$f":"C78","v":"Score"},"min","max"]
[{"$f":"'Validation test'!B15","v":"Gerapporteerde STOF-concentratie"},{"$f":"IF($B3=1,language!A132,\"--\")","v":"niet relevant/onbekend"},-1,0.8,1.2]
[null,{"$f":"IF(OR($B3=0,'Emission data'!G33=\"\",'Emission data'!G33=0),\"--\",CONCATENATE(ROUND('Emission data'!G33*D85,0),\"-\",ROUND(E85*'Emission data'!G33,0),\"  \",language!A93,\" \",M5))","v":"--"},{"$f":"IF(B86=\"--\",-1,0)","v":-1}]
[null,{"$f":"IF(OR($B3=0,'Emission data'!G33=\"\",'Emission data'!G33=0),\"--\",CONCATENATE(\"< \",ROUND('Emission data'!G33*D85,0),\"  \",language!A93,\" \",M5))","v":"--"},{"$f":"IF(B87=\"--\",-1,1)","v":-1}]
[null,{"$f":"IF(OR($B3=0,'Emission data'!G33=\"\",'Emission data'!G33=0),\"--\",CONCATENATE(\">\",ROUND(E85*'Emission data'!G33,0),\"  \",language!A93,\" \",M5))","v":"--"},{"$f":"IF(B88=\"--\",-1,2)","v":-1}]
[{"$f":"A83","v":"Keuze"},1,{"$f":"INDEX(C85:C88,B89)","v":-1}]
[null,null,{"$f":"C78","v":"Score"},"min","max"]
["Reported",{"$f":"IF($B3=1,language!A132,\"--\")","v":"niet relevant/onbekend"},-1,0.8,1.2]
[{"$f":"INDEX(B36:B40,'Emission data'!B33)","v":"STOF-emissie"},{"$f":"IF(OR($A21=0,D92=\"\",D92=0),\"--\",CONCATENATE(ROUND(D93*D91,0),\"-\",ROUND(D93*E91,0),\" \",E93))","v":"--"},{"$f":"IF(B92=\"--\",-1,0)","v":-1},{"$f":"'Emission data'!J$33","v":0},{"$f":"'Emission data'!F33","v":"kg/jaar"}]
[null,{"$f":"IF(OR($A21=0,D92=\"\",D92=0),\"--\",CONCATENATE(\"< \", ROUND(D93*D91,0),\" \",E93))","v":"--"},{"$f":"IF(B93=\"--\",-1,1)","v":-1},{"$f":"IF(D92=\"\",\"--\",IF(D92>100000000,D92/1000000,IF(D92>100000,D92/1000,D92)))","v":0},{"$f":"IF(D92>100000000,language!$A$90,IF(D92>100000,language!$A$89,language!$A$83))","v":"kg/jaar"}]
[null,{"$f":"IF(OR($A21=0,D92=\"\",D92=0),\"--\",CONCATENATE(\"> \", ROUND(D93*E91,0),\" \",E93))","v":"--"},{"$f":"IF(B94=\"--\",-1,2)","v":-1}]
[{"$f":"A83","v":"Keuze"},1,{"$f":"INDEX(C91:C94,B95)","v":-1}]
[null,null,{"$f":"C90","v":"Score"},"min","max"]
[{"$f":"CONCATENATE(language!A135,\" \",language!A137,\" \",language!A38)","v":"Gerapporteerde Emissie-eis SO2"},{"$f":"IF($B3=1,language!A132,\"--\")","v":"niet relevant/onbekend"},-1,1,1.5]
[null,{"$f":"IF(OR($B3=0,'Emission data'!G32=\"\",'Emission data'!G32=0),\"--\",CONCATENATE(ROUND('Emission data'!G32*D97,0),\"-\",ROUND(E97*'Emission data'!G32,0),\"  \",language!A93,\" \",M5))","v":"--"},{"$f":"IF(B98=\"--\",-1,0)","v":-1}]
[null,{"$f":"IF(OR($B3=0,'Emission data'!G32=\"\",'Emission data'!G32=0),\"--\",CONCATENATE(\"< \",ROUND('Emission data'!G32*D97,0),\"  \",language!A93,\" \",M5))","v":"--"},{"$f":"IF(B99=\"--\",-1,1)","v":-1}]
[null,{"$f":"IF(OR($B3=0,'Emission data'!G32=\"\",'Emission data'!G32=0),\"--\",CONCATENATE(\">\",ROUND(E97*'Emission data'!G32,0),\"  \",language!A93,\" \",M5))","v":"--"},{"$f":"IF(B100=\"--\",-1,2)","v":-1}]
[{"$f":"A95","v":"Keuze"},1,{"$f":"INDEX(C97:C100,B101)","v":-1}]
[null,null,{"$f":"C96","v":"Score"},"min","max"]
[{"$f":"'Validation test'!B12","v":"Gerapporteerde SO2-concentratie"},{"$f":"IF($B3=1,language!A132,\"--\")","v":"niet relevant/onbekend"},-1,0.8,1.2]
[null,{"$f":"IF(OR($B3=0,'Emission data'!G32=\"\",,'Emission data'!G32=0),\"--\",CONCATENATE(ROUND('Emission data'!G32*D103,0),\"-\",ROUND(E103*'Emission data'!G32,0),\"  \",language!A93,\" \",M5))","v":"--"},{"$f":"IF(B104=\"--\",-1,0)","v":-1}]
[null,{"$f":"IF(OR($B3=0,'Emission data'!G32=\"\",'Emission data'!G32=0),\"--\",CONCATENATE(\"< \",ROUND('Emission data'!G32*D103,0),\"  \",language!A93,\" \",M5))","v":"--"},{"$f":"IF(B105=\"--\",-1,1)","v":-1}]
[null,{"$f":"IF(OR($B3=0,'Emission data'!G32=\"\",'Emission data'!G32=0),\"--\",CONCATENATE(\">\",ROUND(E103*'Emission data'!G32,0),\"  \",language!A93,\" \",M5))","v":"--"},{"$f":"IF(B106=\"--\",-1,2)","v":-1}]
[{"$f":"A101","v":"Keuze"},1,{"$f":"INDEX(C103:C106,B107)","v":-1}]
[null,null,{"$f":"C96","v":"Score"},"min","max"]
[{"$f":"CONCATENATE(language!A135,\" \",language!A38,\"-\",LOWER(language!A56))","v":"Gerapporteerde SO2-emissie"},{"$f":"IF($B3=1,language!A132,\"--\")","v":"niet relevant/onbekend"},-1,0.8,1.2]
[null,{"$f":"IF(OR($A39=0,D110=\"\",D110=0),\"--\",CONCATENATE(ROUND(D111*D109,0),\"-\",ROUND(D111*E109,0),\" \",E111))","v":"--"},{"$f":"IF(B110=\"--\",-1,0)","v":-1},{"$f":"'Emission data'!J$32","v":0},{"$f":"'Emission data'!F32","v":"kg/jaar"}]
[null,{"$f":"IF(OR($A39=0,D110=\"\",D110=0),\"--\",CONCATENATE(\"< \", ROUND(D111*D109,0),\" \",E111))","v":"--"},{"$f":"IF(B111=\"--\",-1,1)","v":-1},{"$f":"IF(D110=\"\",\"--\",IF(D110>100000000,D110/1000000,IF(D110>100000,D110/1000,D110)))","v":0},{"$f":"IF(D110>100000000,language!$A$90,IF(D110>100000,language!$A$89,language!$A$83))","v":"kg/jaar"}]
[null,{"$f":"IF(OR($A39=0,D110=\"\",D110=0),\"--\",CONCATENATE(\"> \", ROUND(D111*E109,0),\" \",E111))","v":"--"},{"$f":"IF(B112=\"--\",-1,2)","v":-1}]
[{"$f":"A101","v":"Keuze"},1,{"$f":"INDEX(C109:C112,B113)","v":-1}]
[{"$f":"'Validation test'!B7","v":"Gemiddelde belasting"},"min","max"]
[null,0.6,1.05]
[{"$f":"'Validation test'!B8","v":"Gerapporteerde CO2-emissie in % van de theoretische waarde"},"min","max"]
[null,0.95,1.05]
[{"$f":"'Validation test'!B13","v":"Gerapporteerde SO2-emissie in % van de theoretische waarde"},"min","max"]
[null,0.9,1.05]
[null,null,{"$f":"C102","v":"Score"},"min","max"]
[{"$f":"language!A221","v":"Dwarsdoorsnede afgaskanaal"},{"$f":"IF($B$3=1,language!A132,\"--\")","v":"niet relevant/onbekend"},-1,7,15]
[null,{"$f":"IF(AND($B$3=1,D122<>\"\"),CONCATENATE(ROUND(D122/E121,2),\"-\",ROUND(D122/D121,2),\" \",language!A222),\"--\")","v":"0-0 m2"},{"$f":"IF(B122=\"--\",-1,0)","v":0},{"$f":"IF('Emission data'!M37=\"\",\"\",'Emission data'!M37)","v":1.0000000000000002E-2},{"$f":"IF('Emission data'!N37=\"\",\"\",'Emission data'!N37)","v":"m3/s"}]
[null,{"$f":"IF(AND($B$3=1,D122<>\"\"),CONCATENATE(\"< \",ROUND(D122/E121,2),\" \",language!A222),\"--\")","v":"< 0 m2"},{"$f":"IF(B123=\"--\",-1,1)","v":1},{"$f":"IF(D122<100,D122*1000,D122)","v":10.000000000000002},{"$f":"IF(D122<100,language!A106,language!A107)","v":"GASTURBINE"}]
[null,{"$f":"IF(AND($B$3=1,D122<>\"\"),CONCATENATE(\">\",ROUND(D122/D121,2),\" \",language!A222),\"--\")","v":">0 m2"},{"$f":"IF(B124=\"--\",-1,2)","v":2}]
[{"$f":"A113","v":"Keuze"},1,{"$f":"INDEX(C121:C124,B125)","v":-1}]